{"text_format":"1","workbook":"xlsx","n_sheets":4,"sheets":["lista","ESCANDALLO","ex","Hoja2"],"not_rendered":{"charts":0,"images":1,"macros":1,"external_links":0,"defined_names":1,"comments":1,"pivot_tables":0},"unopened":[],"bounds":{"document_bytes":16777216,"sheet_cells":100000,"rows_first":2000,"rows_last":500,"rows_between":2000,"halvings":0,"cell_chars":16384,"cell_head_chars":4096},"cells_cut":0,"cells_raw":0,"read":"whole","date_system":"1900"}

{"sheet":"lista","index":0,"n_rows":828,"n_cols":11,"rows_kept":828,"cut":false,"hidden":false,"merged":[[2,5,2,8]]}
[]
[]
[null,null,"Ref FACTURA",null,null,"Ref cocina",null,null,null,"precio","ud"]
["ARTICULO","Formato","Ud","coste","ud2","Bruto","Neto","% Apvto","Merma","Columna3","Columna4"]
[]
["ABADEJO",1,"Kg",8.9600000000000009,{"$f":"Tabla13[[#This Row],[Ud]]","v":"Kg"},1,0.7,{"$f":"Tabla13[[#This Row],[Neto]]/Tabla13[[#This Row],[Bruto]]","v":0.7},{"$f":"1-H6","v":0.30000000000000004},{"$f":"(1*D6)/B6","v":8.9600000000000009},{"$f":"Tabla13[[#This Row],[ud2]]","v":"Kg"}]
["ACEITE  VIRGEN EXTRA",1,"L",3.1,{"$f":"Tabla13[[#This Row],[Ud]]","v":"L"},1,1,{"$f":"Tabla13[[#This Row],[Neto]]/Tabla13[[#This Row],[Bruto]]","v":1},0,3.1,{"$f":"Tabla13[[#This Row],[ud2]]","v":"L"}]
["ACEITE DE SESÁMO",0.15,"L",5.0999999999999996,{"$f":"Tabla13[[#This Row],[Ud]]","v":"L"},1,1,{"$f":"Tabla13[[#This Row],[Neto]]/Tabla13[[#This Row],[Bruto]]","v":1},0,34,{"$f":"Tabla13[[#This Row],[ud2]]","v":"L"}]
["ACEITE GIRASOL",1,"L",1.5529999999999999,{"$f":"Tabla13[[#This Row],[Ud]]","v":"L"},1,1,{"$f":"Tabla13[[#This Row],[Neto]]/Tabla13[[#This Row],[Bruto]]","v":1},0,1.5529999999999999,{"$f":"Tabla13[[#This Row],[ud2]]","v":"L"}]
["ACEITE OLIVA",1,"L",3.05,{"$f":"Tabla13[[#This Row],[Ud]]","v":"L"},1,1,{"$f":"Tabla13[[#This Row],[Neto]]/Tabla13[[#This Row],[Bruto]]","v":1},0,3.05,{"$f":"Tabla13[[#This Row],[ud2]]","v":"L"}]
["ACEITE VAL DE QUIROGA",1,"L",11.77,{"$f":"Tabla13[[#This Row],[Ud]]","v":"L"},1,1,{"$f":"Tabla13[[#This Row],[Neto]]/Tabla13[[#This Row],[Bruto]]","v":1},0,11.77,{"$f":"Tabla13[[#This Row],[ud2]]","v":"L"}]
["ACEITUNA NEGRA C/ HUESO",0.15,"Kg",0.63,{"$f":"Tabla13[[#This Row],[Ud]]","v":"Kg"},1,1,{"$f":"Tabla13[[#This Row],[Neto]]/Tabla13[[#This Row],[Bruto]]","v":1},0,4.2,{"$f":"Tabla13[[#This Row],[ud2]]","v":"Kg"}]
["ACEITUNA NEGRA S/ HUESO",0.15,"Kg",1.08,{"$f":"Tabla13[[#This Row],[Ud]]","v":"Kg"},1,1,{"$f":"Tabla13[[#This Row],[Neto]]/Tabla13[[#This Row],[Bruto]]","v":1},0,7.2000000000000011,{"$f":"Tabla13[[#This Row],[ud2]]","v":"Kg"}]
["ACEITUNA VERDE C/ ANCHOA",0.15,"Kg",{"$f":"(0.93+0.52)/2","v":0.72500000000000009},{"$f":"Tabla13[[#This Row],[Ud]]","v":"Kg"},1,1,{"$f":"Tabla13[[#This Row],[Neto]]/Tabla13[[#This Row],[Bruto]]","v":1},0,4.8333333333333339,{"$f":"Tabla13[[#This Row],[ud2]]","v":"Kg"}]
["ACEITUNAS VERDE C/ HUESO",0.5,"Kg",1.49,{"$f":"Tabla13[[#This Row],[Ud]]","v":"Kg"},1,1,{"$f":"Tabla13[[#This Row],[Neto]]/Tabla13[[#This Row],[Bruto]]","v":1},0,2.98,{"$f":"Tabla13[[#This Row],[ud2]]","v":"Kg"}]
["ACEITUNAS VERDE S/ HUESO",0.13,"Kg",0.77,{"$f":"Tabla13[[#This Row],[Ud]]","v":"Kg"},1,1,{"$f":"Tabla13[[#This Row],[Neto]]/Tabla13[[#This Row],[Bruto]]","v":1},0,5.9230769230769234,{"$f":"Tabla13[[#This Row],[ud2]]","v":"Kg"}]
["ACELGAS",1,"Kg",0.99,{"$f":"Tabla13[[#This Row],[Ud]]","v":"Kg"},1,0.95,{"$f":"Tabla13[[#This Row],[Neto]]/Tabla13[[#This Row],[Bruto]]","v":0.95},5.0000000000000044E-2,0.99,{"$f":"Tabla13[[#This Row],[ud2]]","v":"Kg"}]
["ACHICORIA",1,"Kg",1.3,{"$f":"Tabla13[[#This Row],[Ud]]","v":"Kg"},1,1,{"$f":"Tabla13[[#This Row],[Neto]]/Tabla13[[#This Row],[Bruto]]","v":1},0,1.3,{"$f":"Tabla13[[#This Row],[ud2]]","v":"Kg"}]
["AFAZRÁN EN RAMA",0.32500000000000001,"Kg",1.35,{"$f":"Tabla13[[#This Row],[Ud]]","v":"Kg"},1,1,{"$f":"Tabla13[[#This Row],[Neto]]/Tabla13[[#This Row],[Bruto]]","v":1},0,4.1538461538461542,{"$f":"Tabla13[[#This Row],[ud2]]","v":"Kg"}]
["AGUACATE",1,"Kg",{"$f":"(3.64+4.056)/2","v":3.8479999999999999},{"$f":"Tabla13[[#This Row],[Ud]]","v":"Kg"},1,0.7,{"$f":"Tabla13[[#This Row],[Neto]]/Tabla13[[#This Row],[Bruto]]","v":0.7},0.30000000000000004,3.8479999999999999,{"$f":"Tabla13[[#This Row],[ud2]]","v":"Kg"}]
["AGUJA DE CERDO C/ HUESO",1,"Kg",3.9,{"$f":"Tabla13[[#This Row],[Ud]]","v":"Kg"},1,0.9,{"$f":"Tabla13[[#This Row],[Neto]]/Tabla13[[#This Row],[Bruto]]","v":0.9},9.9999999999999978E-2,3.9,{"$f":"Tabla13[[#This Row],[ud2]]","v":"Kg"}]
["AGUJA DE CERDO S/ HUESO",1,"Kg",3.99,{"$f":"Tabla13[[#This Row],[Ud]]","v":"Kg"},1,0.9,{"$f":"Tabla13[[#This Row],[Neto]]/Tabla13[[#This Row],[Bruto]]","v":0.9},9.9999999999999978E-2,3.99,{"$f":"Tabla13[[#This Row],[ud2]]","v":"Kg"}]
["AGUJA DE TERNERA S/ HUESO",1,"Kg",5.5,{"$f":"Tabla13[[#This Row],[Ud]]","v":"Kg"},1,0.9,{"$f":"Tabla13[[#This Row],[Neto]]/Tabla13[[#This Row],[Bruto]]","v":0.9},9.9999999999999978E-2,5.5,{"$f":"Tabla13[[#This Row],[ud2]]","v":"Kg"}]
["AJO",1,"Kg",3.9,{"$f":"Tabla13[[#This Row],[Ud]]","v":"Kg"},1,0.95,{"$f":"Tabla13[[#This Row],[Neto]]/Tabla13[[#This Row],[Bruto]]","v":0.95},{"$f":"1-H24","v":5.0000000000000044E-2},{"$f":"(1*D24)/B24","v":3.9},{"$f":"Tabla13[[#This Row],[ud2]]","v":"Kg"}]
["AJO MOLIDO",0.5,"Kg",5.39,{"$f":"Tabla13[[#This Row],[Ud]]","v":"Kg"},1,1,{"$f":"Tabla13[[#This Row],[Neto]]/Tabla13[[#This Row],[Bruto]]","v":1},0,10.78,{"$f":"Tabla13[[#This Row],[ud2]]","v":"Kg"}]
["ALBAHACA",1,"Kg",2.5680000000000001,{"$f":"Tabla13[[#This Row],[Ud]]","v":"Kg"},1,1,{"$f":"Tabla13[[#This Row],[Neto]]/Tabla13[[#This Row],[Bruto]]","v":1},0,2.5680000000000001,{"$f":"Tabla13[[#This Row],[ud2]]","v":"Kg"}]
["ALCACHOFAS CONGELADAS",0.45,"Kg",2.6,{"$f":"Tabla13[[#This Row],[Ud]]","v":"Kg"},1,0.95,{"$f":"Tabla13[[#This Row],[Neto]]/Tabla13[[#This Row],[Bruto]]","v":0.95},5.0000000000000044E-2,5.7777777777777777,{"$f":"Tabla13[[#This Row],[ud2]]","v":"Kg"}]
["ALCACHOFAS CONSERVA",0.33,"Kg",1.35,{"$f":"Tabla13[[#This Row],[Ud]]","v":"Kg"},1,1,{"$f":"Tabla13[[#This Row],[Neto]]/Tabla13[[#This Row],[Bruto]]","v":1},0,4.0909090909090908,{"$f":"Tabla13[[#This Row],[ud2]]","v":"Kg"}]
["ALCAPARRAS",0.14499999999999999,"Kg",1.46,{"$f":"Tabla13[[#This Row],[Ud]]","v":"Kg"},1,1,{"$f":"Tabla13[[#This Row],[Neto]]/Tabla13[[#This Row],[Bruto]]","v":1},0,10.068965517241379,{"$f":"Tabla13[[#This Row],[ud2]]","v":"Kg"}]
["ALFALFA",0.15,"Kg",2.21,{"$f":"Tabla13[[#This Row],[Ud]]","v":"Kg"},1,1,{"$f":"Tabla13[[#This Row],[Neto]]/Tabla13[[#This Row],[Bruto]]","v":1},0,14.733333333333334,{"$f":"Tabla13[[#This Row],[ud2]]","v":"Kg"}]
["ALGA NORI",0.05,"Kg",3.25,{"$f":"Tabla13[[#This Row],[Ud]]","v":"Kg"},1,1,{"$f":"Tabla13[[#This Row],[Neto]]/Tabla13[[#This Row],[Bruto]]","v":1},0,65,{"$f":"Tabla13[[#This Row],[ud2]]","v":"Kg"}]
["APIO-NABO",1,"Kg",1.9239999999999999,{"$f":"Tabla13[[#This Row],[Ud]]","v":"Kg"},1,0.8,{"$f":"Tabla13[[#This Row],[Neto]]/Tabla13[[#This Row],[Bruto]]","v":0.8},0.19999999999999996,1.9239999999999999,{"$f":"Tabla13[[#This Row],[ud2]]","v":"Kg"}]
["BOLETUS EDULIS CONGELADO",1,"Kg",19.588999999999999,{"$f":"Tabla13[[#This Row],[Ud]]","v":"Kg"},1,1,{"$f":"Tabla13[[#This Row],[Neto]]/Tabla13[[#This Row],[Bruto]]","v":1},0,19.588999999999999,{"$f":"Tabla13[[#This Row],[ud2]]","v":"Kg"}]
["BONITO NORTE",1,"Kg",13,{"$f":"Tabla13[[#This Row],[Ud]]","v":"Kg"},1,0.7,{"$f":"Tabla13[[#This Row],[Neto]]/Tabla13[[#This Row],[Bruto]]","v":0.7},0.30000000000000004,13,{"$f":"Tabla13[[#This Row],[ud2]]","v":"Kg"}]
["BOQUERÓN",1,"Kg",7.9,{"$f":"Tabla13[[#This Row],[Ud]]","v":"Kg"},1,0.7,{"$f":"Tabla13[[#This Row],[Neto]]/Tabla13[[#This Row],[Bruto]]","v":0.7},0.30000000000000004,7.9,{"$f":"Tabla13[[#This Row],[ud2]]","v":"Kg"}]
["BRANDY",0.7,"L",5.51,{"$f":"Tabla13[[#This Row],[Ud]]","v":"L"},1,1,{"$f":"Tabla13[[#This Row],[Neto]]/Tabla13[[#This Row],[Bruto]]","v":1},0,7.8714285714285719,{"$f":"Tabla13[[#This Row],[ud2]]","v":"L"}]
["BRECOL",1,"Kg",1.72,{"$f":"Tabla13[[#This Row],[Ud]]","v":"Kg"},1,0.9,{"$f":"Tabla13[[#This Row],[Neto]]/Tabla13[[#This Row],[Bruto]]","v":0.9},9.9999999999999978E-2,1.72,{"$f":"Tabla13[[#This Row],[ud2]]","v":"Kg"}]
["BRILLO PASTELERÍA",5,"Kg",21.24,{"$f":"Tabla13[[#This Row],[Ud]]","v":"Kg"},1,1,{"$f":"Tabla13[[#This Row],[Neto]]/Tabla13[[#This Row],[Bruto]]","v":1},0,4.2479999999999993,{"$f":"Tabla13[[#This Row],[ud2]]","v":"Kg"}]
["BROTES DE SOJA",0.18,"Gr",1.36,{"$f":"Tabla13[[#This Row],[Ud]]","v":"Gr"},1,1,{"$f":"Tabla13[[#This Row],[Neto]]/Tabla13[[#This Row],[Bruto]]","v":1},0,7.5555555555555562,{"$f":"Tabla13[[#This Row],[ud2]]","v":"Gr"}]
["BUEI DE MAR",0.7,"Ud",5.94,{"$f":"Tabla13[[#This Row],[Ud]]","v":"Ud"},1,1,{"$f":"Tabla13[[#This Row],[Neto]]/Tabla13[[#This Row],[Bruto]]","v":1},0,8.4857142857142875,{"$f":"Tabla13[[#This Row],[ud2]]","v":"Ud"}]
["BUTELO",1,"Kg",10.51,{"$f":"Tabla13[[#This Row],[Ud]]","v":"Kg"},1,1,{"$f":"Tabla13[[#This Row],[Neto]]/Tabla13[[#This Row],[Bruto]]","v":1},0,10.51,{"$f":"Tabla13[[#This Row],[ud2]]","v":"Kg"}]
["CABALLA",1,"Kg",4,{"$f":"Tabla13[[#This Row],[Ud]]","v":"Kg"},1,0.75,{"$f":"Tabla13[[#This Row],[Neto]]/Tabla13[[#This Row],[Bruto]]","v":0.75},0.25,4,{"$f":"Tabla13[[#This Row],[ud2]]","v":"Kg"}]
["CABALLA",1,"KG",4,{"$f":"Tabla13[[#This Row],[Ud]]","v":"KG"},1,0.7,{"$f":"G43/F43","v":0.7},0.30000000000000004,4,{"$f":"Tabla13[[#This Row],[ud2]]","v":"KG"}]
["CABELLO DE ANGEL",0.85,"Kg",2.1379999999999999,{"$f":"Tabla13[[#This Row],[Ud]]","v":"Kg"},1,1,{"$f":"Tabla13[[#This Row],[Neto]]/Tabla13[[#This Row],[Bruto]]","v":1},0,2.5152941176470587,{"$f":"Tabla13[[#This Row],[ud2]]","v":"Kg"}]
["CABRACHO",2.6,"Kg",17.39,{"$f":"Tabla13[[#This Row],[Ud]]","v":"Kg"},1,0.75,{"$f":"Tabla13[[#This Row],[Neto]]/Tabla13[[#This Row],[Bruto]]","v":0.75},0.25,6.6884615384615387,{"$f":"Tabla13[[#This Row],[ud2]]","v":"Kg"}]
["CACAHUETE FRITO",0.25,"Gr",1.57,{"$f":"Tabla13[[#This Row],[Ud]]","v":"Gr"},1,1,{"$f":"Tabla13[[#This Row],[Neto]]/Tabla13[[#This Row],[Bruto]]","v":1},0,6.28,{"$f":"Tabla13[[#This Row],[ud2]]","v":"Gr"}]
["CACAO EN POLVO",1,"Kg",3,{"$f":"Tabla13[[#This Row],[Ud]]","v":"Kg"},1,1,{"$f":"Tabla13[[#This Row],[Neto]]/Tabla13[[#This Row],[Bruto]]","v":1},0,3,{"$f":"Tabla13[[#This Row],[ud2]]","v":"Kg"}]
["CACHOLA CERDO SALADA",1,"Kg",2.74,{"$f":"Tabla13[[#This Row],[Ud]]","v":"Kg"},1,1,{"$f":"Tabla13[[#This Row],[Neto]]/Tabla13[[#This Row],[Bruto]]","v":1},0,2.74,{"$f":"Tabla13[[#This Row],[ud2]]","v":"Kg"}]
["CALABACÍN",1,"Kg",1.04,{"$f":"Tabla13[[#This Row],[Ud]]","v":"Kg"},1,0.95,{"$f":"Tabla13[[#This Row],[Neto]]/Tabla13[[#This Row],[Bruto]]","v":0.95},5.0000000000000044E-2,1.04,{"$f":"Tabla13[[#This Row],[ud2]]","v":"Kg"}]
["CALABAZA",1,"Kg",1.04,{"$f":"Tabla13[[#This Row],[Ud]]","v":"Kg"},1,0.85,{"$f":"Tabla13[[#This Row],[Neto]]/Tabla13[[#This Row],[Bruto]]","v":0.85},0.15000000000000002,1.04,{"$f":"Tabla13[[#This Row],[ud2]]","v":"Kg"}]
["CALAMAR CONGELADO, TUBO",1,"KG",6.5,{"$f":"Tabla13[[#This Row],[Ud]]","v":"KG"},1,1,{"$f":"G51/F51","v":1},0,6.5,{"$f":"Tabla13[[#This Row],[ud2]]","v":"KG"}]
["CALLOS",1,"Kg",4.8,{"$f":"Tabla13[[#This Row],[Ud]]","v":"Kg"},1,1,{"$f":"Tabla13[[#This Row],[Neto]]/Tabla13[[#This Row],[Bruto]]","v":1},0,4.8,{"$f":"Tabla13[[#This Row],[ud2]]","v":"Kg"}]
["CANELA EN RAMA",0.3,"Kg",7.74,{"$f":"Tabla13[[#This Row],[Ud]]","v":"Kg"},1,1,{"$f":"Tabla13[[#This Row],[Neto]]/Tabla13[[#This Row],[Bruto]]","v":1},0,25.8,{"$f":"Tabla13[[#This Row],[ud2]]","v":"Kg"}]
["CANELA MOLIDA",0.85199999999999998,"Kg",3.5840000000000001,{"$f":"Tabla13[[#This Row],[Ud]]","v":"Kg"},1,1,{"$f":"Tabla13[[#This Row],[Neto]]/Tabla13[[#This Row],[Bruto]]","v":1},0,4.206572769953052,{"$f":"Tabla13[[#This Row],[ud2]]","v":"Kg"}]
["CANELONES",120,"Ud",7.1150000000000002,{"$f":"Tabla13[[#This Row],[Ud]]","v":"Ud"},1,1,{"$f":"Tabla13[[#This Row],[Neto]]/Tabla13[[#This Row],[Bruto]]","v":1},0,5.9291666666666666E-2,{"$f":"Tabla13[[#This Row],[ud2]]","v":"Ud"}]
["CANÓNIGOS",0.12,"Kg",1.29,{"$f":"Tabla13[[#This Row],[Ud]]","v":"Kg"},1,1,{"$f":"Tabla13[[#This Row],[Neto]]/Tabla13[[#This Row],[Bruto]]","v":1},0,10.75,{"$f":"Tabla13[[#This Row],[ud2]]","v":"Kg"}]
["CANÓNIGOS",1,"BOLSA",1.7250000000000001,{"$f":"Tabla13[[#This Row],[Ud]]","v":"BOLSA"},1,1,{"$f":"G57/F57","v":1},0,1.7250000000000001,{"$f":"Tabla13[[#This Row],[ud2]]","v":"BOLSA"}]
["CANUTILLOS DE CHOCOLATE",0.1,"Kg",0.96,{"$f":"Tabla13[[#This Row],[Ud]]","v":"Kg"},1,1,{"$f":"Tabla13[[#This Row],[Neto]]/Tabla13[[#This Row],[Bruto]]","v":1},0,9.6,{"$f":"Tabla13[[#This Row],[ud2]]","v":"Kg"}]
["CARACOLES CONGELADOS",0.45,"Kg",3,{"$f":"Tabla13[[#This Row],[Ud]]","v":"Kg"},1,1,{"$f":"Tabla13[[#This Row],[Neto]]/Tabla13[[#This Row],[Bruto]]","v":1},0,6.6666666666666661,{"$f":"Tabla13[[#This Row],[ud2]]","v":"Kg"}]
["CARAMELO LÍQUIDO",0.4,"Kg",1.79,{"$f":"Tabla13[[#This Row],[Ud]]","v":"Kg"},1,1,{"$f":"Tabla13[[#This Row],[Neto]]/Tabla13[[#This Row],[Bruto]]","v":1},0,4.4749999999999996,{"$f":"Tabla13[[#This Row],[ud2]]","v":"Kg"}]
["CARCASAS DE POLO",1,"Kg",0.45,{"$f":"Tabla13[[#This Row],[Ud]]","v":"Kg"},1,0.9,{"$f":"Tabla13[[#This Row],[Neto]]/Tabla13[[#This Row],[Bruto]]","v":0.9},9.9999999999999978E-2,0.45,{"$f":"Tabla13[[#This Row],[ud2]]","v":"Kg"}]
["CARIOCAS",1,"Kg",5.25,{"$f":"Tabla13[[#This Row],[Ud]]","v":"Kg"},1,1,{"$f":"Tabla13[[#This Row],[Neto]]/Tabla13[[#This Row],[Bruto]]","v":1},0,5.25,{"$f":"Tabla13[[#This Row],[ud2]]","v":"Kg"}]
["CARNE PICADA CERDO",1,"Kg",4.03,{"$f":"Tabla13[[#This Row],[Ud]]","v":"Kg"},1,1,{"$f":"Tabla13[[#This Row],[Neto]]/Tabla13[[#This Row],[Bruto]]","v":1},0,4.03,{"$f":"Tabla13[[#This Row],[ud2]]","v":"Kg"}]
["CARNE PICADA MIXTA",1,"Kg",5.04,{"$f":"Tabla13[[#This Row],[Ud]]","v":"Kg"},1,1,{"$f":"Tabla13[[#This Row],[Neto]]/Tabla13[[#This Row],[Bruto]]","v":1},0,5.04,{"$f":"Tabla13[[#This Row],[ud2]]","v":"Kg"}]
["CARNE PICADA TERNERA",1,"Kg",6.01,{"$f":"Tabla13[[#This Row],[Ud]]","v":"Kg"},1,1,{"$f":"Tabla13[[#This Row],[Neto]]/Tabla13[[#This Row],[Bruto]]","v":1},0,6.01,{"$f":"Tabla13[[#This Row],[ud2]]","v":"Kg"}]
["CARRILLERAS DE CERDO ",1,"Kg",7.58,{"$f":"Tabla13[[#This Row],[Ud]]","v":"Kg"},1,0.85,{"$f":"Tabla13[[#This Row],[Neto]]/Tabla13[[#This Row],[Bruto]]","v":0.85},0.15000000000000002,7.58,{"$f":"Tabla13[[#This Row],[ud2]]","v":"Kg"}]
["CARRILLERAS DE CERDO IBÉRICO CONGELADAS",1,"Kg",5.35,{"$f":"Tabla13[[#This Row],[Ud]]","v":"Kg"},1,0.85,{"$f":"Tabla13[[#This Row],[Neto]]/Tabla13[[#This Row],[Bruto]]","v":0.85},0.15000000000000002,5.35,{"$f":"Tabla13[[#This Row],[ud2]]","v":"Kg"}]
["CARRILLERAS DE TERNERA",1,"Kg",9.5399999999999991,{"$f":"Tabla13[[#This Row],[Ud]]","v":"Kg"},1,0.9,{"$f":"Tabla13[[#This Row],[Neto]]/Tabla13[[#This Row],[Bruto]]","v":0.9},9.9999999999999978E-2,9.5399999999999991,{"$f":"Tabla13[[#This Row],[ud2]]","v":"Kg"}]
["CASTAÑAS",1,"Kg",{"$f":"(1.56+1.456)/2","v":1.508},{"$f":"Tabla13[[#This Row],[Ud]]","v":"Kg"},1,0.9,{"$f":"Tabla13[[#This Row],[Neto]]/Tabla13[[#This Row],[Bruto]]","v":0.9},9.9999999999999978E-2,1.508,{"$f":"Tabla13[[#This Row],[ud2]]","v":"Kg"}]
["CASTAÑAS CONGELADAS",1,"Kg",4.992,{"$f":"Tabla13[[#This Row],[Ud]]","v":"Kg"},1,1,{"$f":"Tabla13[[#This Row],[Neto]]/Tabla13[[#This Row],[Bruto]]","v":1},0,4.992,{"$f":"Tabla13[[#This Row],[ud2]]","v":"Kg"}]
["CASTAÑETA",1,"Kg",6.42,{"$f":"Tabla13[[#This Row],[Ud]]","v":"Kg"},1,0.7,{"$f":"Tabla13[[#This Row],[Neto]]/Tabla13[[#This Row],[Bruto]]","v":0.7},{"$f":"1-H71","v":0.30000000000000004},{"$f":"(1*D71)/B71","v":6.42},{"$f":"Tabla13[[#This Row],[ud2]]","v":"Kg"}]
["CAVI-ART, SUCEDÁNEO",7.4999999999999997E-2,"Kg",2,{"$f":"Tabla13[[#This Row],[Ud]]","v":"Kg"},1,1,{"$f":"Tabla13[[#This Row],[Neto]]/Tabla13[[#This Row],[Bruto]]","v":1},0,26.666666666666668,{"$f":"Tabla13[[#This Row],[ud2]]","v":"Kg"}]
["CAYENA",1.7000000000000001E-2,"Kg",0.85,{"$f":"Tabla13[[#This Row],[Ud]]","v":"Kg"},1,1,{"$f":"Tabla13[[#This Row],[Neto]]/Tabla13[[#This Row],[Bruto]]","v":1},0,49.999999999999993,{"$f":"Tabla13[[#This Row],[ud2]]","v":"Kg"}]
["CEBOLLA",1,"Kg",1.29,{"$f":"Tabla13[[#This Row],[Ud]]","v":"Kg"},1,0.9,{"$f":"Tabla13[[#This Row],[Neto]]/Tabla13[[#This Row],[Bruto]]","v":0.9},9.9999999999999978E-2,1.29,{"$f":"Tabla13[[#This Row],[ud2]]","v":"Kg"}]
["CEBOLLA FRANCESA",1,"Kg",2.2999999999999998,{"$f":"Tabla13[[#This Row],[Ud]]","v":"Kg"},1,0.9,{"$f":"Tabla13[[#This Row],[Neto]]/Tabla13[[#This Row],[Bruto]]","v":0.9},9.9999999999999978E-2,2.2999999999999998,{"$f":"Tabla13[[#This Row],[ud2]]","v":"Kg"}]
["CEBOLLA ROJA",1,"Kg",1.69,{"$f":"Tabla13[[#This Row],[Ud]]","v":"Kg"},1,0.9,{"$f":"Tabla13[[#This Row],[Neto]]/Tabla13[[#This Row],[Bruto]]","v":0.9},9.9999999999999978E-2,1.69,{"$f":"Tabla13[[#This Row],[ud2]]","v":"Kg"}]
["CEBOLLETA",0.18,"Kg",0.93,{"$f":"Tabla13[[#This Row],[Ud]]","v":"Kg"},1,0.8,{"$f":"Tabla13[[#This Row],[Neto]]/Tabla13[[#This Row],[Bruto]]","v":0.8},0.19999999999999996,5.166666666666667,{"$f":"Tabla13[[#This Row],[ud2]]","v":"Kg"}]
["CEBOLLINO",0.02,"Kg",1.86,{"$f":"Tabla13[[#This Row],[Ud]]","v":"Kg"},1,1,{"$f":"Tabla13[[#This Row],[Neto]]/Tabla13[[#This Row],[Bruto]]","v":1},0,93,{"$f":"Tabla13[[#This Row],[ud2]]","v":"Kg"}]
["CECINA",1,"Kg",26.2,{"$f":"Tabla13[[#This Row],[Ud]]","v":"Kg"},1,1,{"$f":"Tabla13[[#This Row],[Neto]]/Tabla13[[#This Row],[Bruto]]","v":1},0,26.2,{"$f":"Tabla13[[#This Row],[ud2]]","v":"Kg"}]
["CENTOLLA GALLEGA",1,"Ud",7.02,{"$f":"Tabla13[[#This Row],[Ud]]","v":"Ud"},1,1,{"$f":"Tabla13[[#This Row],[Neto]]/Tabla13[[#This Row],[Bruto]]","v":1},0,7.02,{"$f":"Tabla13[[#This Row],[ud2]]","v":"Ud"}]
["CENTOLLO ",1,"Ud",9.18,{"$f":"Tabla13[[#This Row],[Ud]]","v":"Ud"},1,1,{"$f":"Tabla13[[#This Row],[Neto]]/Tabla13[[#This Row],[Bruto]]","v":1},0,9.18,{"$f":"Tabla13[[#This Row],[ud2]]","v":"Ud"}]
["CEREZAS CONFITADAS",1,"Kg",7.0620000000000003,{"$f":"Tabla13[[#This Row],[Ud]]","v":"Kg"},1,1,{"$f":"Tabla13[[#This Row],[Neto]]/Tabla13[[#This Row],[Bruto]]","v":1},0,7.0620000000000003,{"$f":"Tabla13[[#This Row],[ud2]]","v":"Kg"}]
["CHALOTA",1,"Kg",0.89,{"$f":"Tabla13[[#This Row],[Ud]]","v":"Kg"},1,0.9,{"$f":"Tabla13[[#This Row],[Neto]]/Tabla13[[#This Row],[Bruto]]","v":0.9},9.9999999999999978E-2,0.89,{"$f":"Tabla13[[#This Row],[ud2]]","v":"Kg"}]
["CHAMPIÑONES",1,"kg",3.11,{"$f":"Tabla13[[#This Row],[Ud]]","v":"kg"},1,0.9,{"$f":"Tabla13[[#This Row],[Neto]]/Tabla13[[#This Row],[Bruto]]","v":0.9},9.9999999999999978E-2,3.11,{"$f":"Tabla13[[#This Row],[ud2]]","v":"kg"}]
["CHAPATA SIN GLUTEN",0.19,"Kg",1.75,{"$f":"Tabla13[[#This Row],[Ud]]","v":"Kg"},1,1,{"$f":"Tabla13[[#This Row],[Neto]]/Tabla13[[#This Row],[Bruto]]","v":1},0,9.2105263157894743,{"$f":"Tabla13[[#This Row],[ud2]]","v":"Kg"}]
["CHICHARONES DE CERDO ",1,"Kg",6.5,{"$f":"Tabla13[[#This Row],[Ud]]","v":"Kg"},1,1,{"$f":"Tabla13[[#This Row],[Neto]]/Tabla13[[#This Row],[Bruto]]","v":1},0,6.5,{"$f":"Tabla13[[#This Row],[ud2]]","v":"Kg"}]
["CHIPIRÓN ",1,"Kg",4,{"$f":"Tabla13[[#This Row],[Ud]]","v":"Kg"},1,0.65,{"$f":"Tabla13[[#This Row],[Neto]]/Tabla13[[#This Row],[Bruto]]","v":0.65},0.35,4,{"$f":"Tabla13[[#This Row],[ud2]]","v":"Kg"}]
["CHIPIRÓN CONGELADO",1,"Kg",6.5,{"$f":"Tabla13[[#This Row],[Ud]]","v":"Kg"},1,0.5,{"$f":"Tabla13[[#This Row],[Neto]]/Tabla13[[#This Row],[Bruto]]","v":0.5},0.5,6.5,{"$f":"Tabla13[[#This Row],[ud2]]","v":"Kg"}]
["CHOCOLATE A LA TAZA",0.5,"Kg",1.1599999999999999,{"$f":"Tabla13[[#This Row],[Ud]]","v":"Kg"},1,1,{"$f":"Tabla13[[#This Row],[Neto]]/Tabla13[[#This Row],[Bruto]]","v":1},0,2.3199999999999998,{"$f":"Tabla13[[#This Row],[ud2]]","v":"Kg"}]
["CHULETERO DE TERNERA",1,"Kg",10.35,{"$f":"Tabla13[[#This Row],[Ud]]","v":"Kg"},1,0.8,{"$f":"Tabla13[[#This Row],[Neto]]/Tabla13[[#This Row],[Bruto]]","v":0.8},0.19999999999999996,10.35,{"$f":"Tabla13[[#This Row],[ud2]]","v":"Kg"}]
["CORDERO CONGELADO",11,"Kg",7.92,{"$f":"Tabla13[[#This Row],[Ud]]","v":"Kg"},1,1,{"$f":"Tabla13[[#This Row],[Neto]]/Tabla13[[#This Row],[Bruto]]","v":1},0,0.72,{"$f":"Tabla13[[#This Row],[ud2]]","v":"Kg"}]
["CUAJADA",4.8000000000000001E-2,"Gr",0.96,{"$f":"Tabla13[[#This Row],[Ud]]","v":"Gr"},1,1,{"$f":"Tabla13[[#This Row],[Neto]]/Tabla13[[#This Row],[Bruto]]","v":1},0,20,{"$f":"Tabla13[[#This Row],[ud2]]","v":"Gr"}]
["FAISAN CONGELADO",1,"Kg",10.164999999999999,{"$f":"Tabla13[[#This Row],[Ud]]","v":"Kg"},1,0.8,{"$f":"Tabla13[[#This Row],[Neto]]/Tabla13[[#This Row],[Bruto]]","v":0.8},0.19999999999999996,10.164999999999999,{"$f":"Tabla13[[#This Row],[ud2]]","v":"Kg"}]
["FALDA TERNERA S/ HUESO",1,"Kg",5.0999999999999996,{"$f":"Tabla13[[#This Row],[Ud]]","v":"Kg"},1,0.9,{"$f":"Tabla13[[#This Row],[Neto]]/Tabla13[[#This Row],[Bruto]]","v":0.9},9.9999999999999978E-2,5.0999999999999996,{"$f":"Tabla13[[#This Row],[ud2]]","v":"Kg"}]
["FIDEO ARROZ",0.25,"Kg",2.1,{"$f":"Tabla13[[#This Row],[Ud]]","v":"Kg"},1,1,{"$f":"Tabla13[[#This Row],[Neto]]/Tabla13[[#This Row],[Bruto]]","v":1},0,8.4,{"$f":"Tabla13[[#This Row],[ud2]]","v":"Kg"}]
["FIDEO CHINO",0.25,"Kg",0.99,{"$f":"Tabla13[[#This Row],[Ud]]","v":"Kg"},1,1,{"$f":"Tabla13[[#This Row],[Neto]]/Tabla13[[#This Row],[Bruto]]","v":1},0,3.96,{"$f":"Tabla13[[#This Row],[ud2]]","v":"Kg"}]
["FIDEO FIDEUÁ",0.5,"Kg",0.79,{"$f":"Tabla13[[#This Row],[Ud]]","v":"Kg"},1,1,{"$f":"Tabla13[[#This Row],[Neto]]/Tabla13[[#This Row],[Bruto]]","v":1},0,1.58,{"$f":"Tabla13[[#This Row],[ud2]]","v":"Kg"}]
["FIDEO FINO",0.25,"Kg",0.56999999999999995,{"$f":"Tabla13[[#This Row],[Ud]]","v":"Kg"},1,1,{"$f":"Tabla13[[#This Row],[Neto]]/Tabla13[[#This Row],[Bruto]]","v":1},0,2.2799999999999998,{"$f":"Tabla13[[#This Row],[ud2]]","v":"Kg"}]
["FIDEO GORDO",0.5,"Kg",0.42,{"$f":"Tabla13[[#This Row],[Ud]]","v":"Kg"},1,1,{"$f":"Tabla13[[#This Row],[Neto]]/Tabla13[[#This Row],[Bruto]]","v":1},0,0.84,{"$f":"Tabla13[[#This Row],[ud2]]","v":"Kg"}]
["FILETE DE MERLUZA",1,"Kg",4.8600000000000003,{"$f":"Tabla13[[#This Row],[Ud]]","v":"Kg"},1,0.9,{"$f":"Tabla13[[#This Row],[Neto]]/Tabla13[[#This Row],[Bruto]]","v":0.9},9.9999999999999978E-2,4.8600000000000003,{"$f":"Tabla13[[#This Row],[ud2]]","v":"Kg"}]
["FILETE DE TERNERA",1,"Kg",8.0299999999999994,{"$f":"Tabla13[[#This Row],[Ud]]","v":"Kg"},1,1,{"$f":"Tabla13[[#This Row],[Neto]]/Tabla13[[#This Row],[Bruto]]","v":1},0,8.0299999999999994,{"$f":"Tabla13[[#This Row],[ud2]]","v":"Kg"}]
["FOIE DE PATO",0.73,"Kg",24.21,{"$f":"Tabla13[[#This Row],[Ud]]","v":"Kg"},1,1,{"$f":"Tabla13[[#This Row],[Neto]]/Tabla13[[#This Row],[Bruto]]","v":1},0,33.164383561643838,{"$f":"Tabla13[[#This Row],[ud2]]","v":"Kg"}]
["FOIE-GRASS",0.115,"Kg",1.28,{"$f":"Tabla13[[#This Row],[Ud]]","v":"Kg"},1,1,{"$f":"Tabla13[[#This Row],[Neto]]/Tabla13[[#This Row],[Bruto]]","v":1},0,11.130434782608695,{"$f":"Tabla13[[#This Row],[ud2]]","v":"Kg"}]
["FRAMBUESA",0.125,"Kg",3.536,{"$f":"Tabla13[[#This Row],[Ud]]","v":"Kg"},1,1,{"$f":"Tabla13[[#This Row],[Neto]]/Tabla13[[#This Row],[Bruto]]","v":1},0,28.288,{"$f":"Tabla13[[#This Row],[ud2]]","v":"Kg"}]
["FRAMBUESA CONGELADA",1,"Kg",10.266999999999999,{"$f":"Tabla13[[#This Row],[Ud]]","v":"Kg"},1,1,{"$f":"Tabla13[[#This Row],[Neto]]/Tabla13[[#This Row],[Bruto]]","v":1},0,10.266999999999999,{"$f":"Tabla13[[#This Row],[ud2]]","v":"Kg"}]
["FRAMBUESA LIOFILIZADA",0.5,"Kg",41.256,{"$f":"Tabla13[[#This Row],[Ud]]","v":"Kg"},1,1,{"$f":"Tabla13[[#This Row],[Neto]]/Tabla13[[#This Row],[Bruto]]","v":1},0,82.512,{"$f":"Tabla13[[#This Row],[ud2]]","v":"Kg"}]
["FRESÓN",1,"Kg",4.2,{"$f":"Tabla13[[#This Row],[Ud]]","v":"Kg"},1,1,{"$f":"Tabla13[[#This Row],[Neto]]/Tabla13[[#This Row],[Bruto]]","v":1},0,4.2,{"$f":"Tabla13[[#This Row],[ud2]]","v":"Kg"}]
["FRUCTOSA",0.25,"Kg",2.1,{"$f":"Tabla13[[#This Row],[Ud]]","v":"Kg"},1,1,{"$f":"Tabla13[[#This Row],[Neto]]/Tabla13[[#This Row],[Bruto]]","v":1},0,8.4,{"$f":"Tabla13[[#This Row],[ud2]]","v":"Kg"}]
["FRUTA DE LA PASIÓN",1,"Kg",1.768,{"$f":"Tabla13[[#This Row],[Ud]]","v":"Kg"},1,1,{"$f":"Tabla13[[#This Row],[Neto]]/Tabla13[[#This Row],[Bruto]]","v":1},0,1.768,{"$f":"Tabla13[[#This Row],[ud2]]","v":"Kg"}]
["FRUTAS ESCARCHADAS",1.5,"Kg",16.998999999999999,{"$f":"Tabla13[[#This Row],[Ud]]","v":"Kg"},1,1,{"$f":"Tabla13[[#This Row],[Neto]]/Tabla13[[#This Row],[Bruto]]","v":1},0,11.332666666666666,{"$f":"Tabla13[[#This Row],[ud2]]","v":"Kg"}]
["FRUTOS DEL BOSQUE CONGELADOS",2.5,"Kg",6.3040000000000003,{"$f":"Tabla13[[#This Row],[Ud]]","v":"Kg"},1,1,{"$f":"Tabla13[[#This Row],[Neto]]/Tabla13[[#This Row],[Bruto]]","v":1},0,2.5216000000000003,{"$f":"Tabla13[[#This Row],[ud2]]","v":"Kg"}]
["GALLINA FRESCA",1.0449999999999999,"Kg",2.35,{"$f":"Tabla13[[#This Row],[Ud]]","v":"Kg"},1,0.85,{"$f":"Tabla13[[#This Row],[Neto]]/Tabla13[[#This Row],[Bruto]]","v":0.85},0.15000000000000002,2.2488038277511966,{"$f":"Tabla13[[#This Row],[ud2]]","v":"Kg"}]
["GALLO FRESCO",0.4,"Kg",10.26,{"$f":"Tabla13[[#This Row],[Ud]]","v":"Kg"},1,0.8,{"$f":"Tabla13[[#This Row],[Neto]]/Tabla13[[#This Row],[Bruto]]","v":0.8},0.19999999999999996,25.65,{"$f":"Tabla13[[#This Row],[ud2]]","v":"Kg"}]
["GAMBA PELADA",1,"Kg",{"$f":"(6.955+6.152)/2","v":6.5534999999999997},{"$f":"Tabla13[[#This Row],[Ud]]","v":"Kg"},1,1,{"$f":"Tabla13[[#This Row],[Neto]]/Tabla13[[#This Row],[Bruto]]","v":1},0,6.5534999999999997,{"$f":"Tabla13[[#This Row],[ud2]]","v":"Kg"}]
["GAMBAS",1,"Kg",12.79,{"$f":"Tabla13[[#This Row],[Ud]]","v":"Kg"},1,1,{"$f":"Tabla13[[#This Row],[Neto]]/Tabla13[[#This Row],[Bruto]]","v":1},0,12.79,{"$f":"Tabla13[[#This Row],[ud2]]","v":"Kg"}]
["GAMBÓN",1,"Kg",7.1280000000000001,{"$f":"Tabla13[[#This Row],[Ud]]","v":"Kg"},1,1,{"$f":"Tabla13[[#This Row],[Neto]]/Tabla13[[#This Row],[Bruto]]","v":1},0,7.1280000000000001,{"$f":"Tabla13[[#This Row],[ud2]]","v":"Kg"}]
["GARBANZO",1,"Kg",2.48,{"$f":"Tabla13[[#This Row],[Ud]]","v":"Kg"},1,1,{"$f":"Tabla13[[#This Row],[Neto]]/Tabla13[[#This Row],[Bruto]]","v":1},0,2.48,{"$f":"Tabla13[[#This Row],[ud2]]","v":"Kg"}]
["GARBANZO CONSERVA",0.4,"Kg",0.42,{"$f":"Tabla13[[#This Row],[Ud]]","v":"Kg"},1,1,{"$f":"Tabla13[[#This Row],[Neto]]/Tabla13[[#This Row],[Bruto]]","v":1},0,1.0499999999999998,{"$f":"Tabla13[[#This Row],[ud2]]","v":"Kg"}]
["GRANADA",1,"Kg",1.8720000000000001,{"$f":"Tabla13[[#This Row],[Ud]]","v":"Kg"},1,1,{"$f":"Tabla13[[#This Row],[Neto]]/Tabla13[[#This Row],[Bruto]]","v":1},0,1.8720000000000001,{"$f":"Tabla13[[#This Row],[ud2]]","v":"Kg"}]
["GRANILLO ALMENDRA",5,"Kg",4.992,{"$f":"Tabla13[[#This Row],[Ud]]","v":"Kg"},1,1,{"$f":"Tabla13[[#This Row],[Neto]]/Tabla13[[#This Row],[Bruto]]","v":1},0,0.99839999999999995,{"$f":"Tabla13[[#This Row],[ud2]]","v":"Kg"}]
["GROSELLAS",0.15,"Kg",3.952,{"$f":"Tabla13[[#This Row],[Ud]]","v":"Kg"},1,1,{"$f":"Tabla13[[#This Row],[Neto]]/Tabla13[[#This Row],[Bruto]]","v":1},0,26.346666666666668,{"$f":"Tabla13[[#This Row],[ud2]]","v":"Kg"}]
["GUINDILLA",0.08,"Kg",1.56,{"$f":"Tabla13[[#This Row],[Ud]]","v":"Kg"},1,1,{"$f":"Tabla13[[#This Row],[Neto]]/Tabla13[[#This Row],[Bruto]]","v":1},0,19.5,{"$f":"Tabla13[[#This Row],[ud2]]","v":"Kg"}]
["HABA NEGRA",0.5,"Kg",0.96,{"$f":"Tabla13[[#This Row],[Ud]]","v":"Kg"},1,1,{"$f":"Tabla13[[#This Row],[Neto]]/Tabla13[[#This Row],[Bruto]]","v":1},0,1.92,{"$f":"Tabla13[[#This Row],[ud2]]","v":"Kg"}]
["HABA PINTA",1,"Kg",2.65,{"$f":"Tabla13[[#This Row],[Ud]]","v":"Kg"},1,1,{"$f":"Tabla13[[#This Row],[Neto]]/Tabla13[[#This Row],[Bruto]]","v":1},0,2.65,{"$f":"Tabla13[[#This Row],[ud2]]","v":"Kg"}]
["HABA ROJA",0.5,"Kg",0.95,{"$f":"Tabla13[[#This Row],[Ud]]","v":"Kg"},1,1,{"$f":"Tabla13[[#This Row],[Neto]]/Tabla13[[#This Row],[Bruto]]","v":1},0,1.9,{"$f":"Tabla13[[#This Row],[ud2]]","v":"Kg"}]
["HABAS",0.5,"Kg",2.0699999999999998,{"$f":"Tabla13[[#This Row],[Ud]]","v":"Kg"},1,1,{"$f":"Tabla13[[#This Row],[Neto]]/Tabla13[[#This Row],[Bruto]]","v":1},0,4.1399999999999997,{"$f":"Tabla13[[#This Row],[ud2]]","v":"Kg"}]
["HAMBURGUESA MIXTA",1,"Kg",5.45,{"$f":"Tabla13[[#This Row],[Ud]]","v":"Kg"},1,1,{"$f":"Tabla13[[#This Row],[Neto]]/Tabla13[[#This Row],[Bruto]]","v":1},0,5.45,{"$f":"Tabla13[[#This Row],[ud2]]","v":"Kg"}]
["HARINA",1,"Kg",0.45,{"$f":"Tabla13[[#This Row],[Ud]]","v":"Kg"},1,1,{"$f":"Tabla13[[#This Row],[Neto]]/Tabla13[[#This Row],[Bruto]]","v":1},0,0.45,{"$f":"Tabla13[[#This Row],[ud2]]","v":"Kg"}]
["HARINA DE ALMENDRA",10,"Kg",4.8259999999999996,{"$f":"Tabla13[[#This Row],[Ud]]","v":"Kg"},1,1,{"$f":"Tabla13[[#This Row],[Neto]]/Tabla13[[#This Row],[Bruto]]","v":1},0,0.48259999999999997,{"$f":"Tabla13[[#This Row],[ud2]]","v":"Kg"}]
["HARINA DE CASTAÑA",0.4,"Kg",2.6,{"$f":"Tabla13[[#This Row],[Ud]]","v":"Kg"},1,1,{"$f":"Tabla13[[#This Row],[Neto]]/Tabla13[[#This Row],[Bruto]]","v":1},0,6.5,{"$f":"Tabla13[[#This Row],[ud2]]","v":"Kg"}]
["HARINA DE CENTENO",1,"Kg",0.50960000000000005,{"$f":"Tabla13[[#This Row],[Ud]]","v":"Kg"},1,1,{"$f":"Tabla13[[#This Row],[Neto]]/Tabla13[[#This Row],[Bruto]]","v":1},0,0.50960000000000005,{"$f":"Tabla13[[#This Row],[ud2]]","v":"Kg"}]
["HARINA DE FUERZA",1,"Kg",0.56159999999999999,{"$f":"Tabla13[[#This Row],[Ud]]","v":"Kg"},1,1,{"$f":"Tabla13[[#This Row],[Neto]]/Tabla13[[#This Row],[Bruto]]","v":1},0,0.56159999999999999,{"$f":"Tabla13[[#This Row],[ud2]]","v":"Kg"}]
["HARINA DE MAIZ",1,"Kg",1.93,{"$f":"Tabla13[[#This Row],[Ud]]","v":"Kg"},1,1,{"$f":"Tabla13[[#This Row],[Neto]]/Tabla13[[#This Row],[Bruto]]","v":1},0,1.93,{"$f":"Tabla13[[#This Row],[ud2]]","v":"Kg"}]
["HARINA DE TEMPURA",0.5,"Kg",1.45,{"$f":"Tabla13[[#This Row],[Ud]]","v":"Kg"},1,1,{"$f":"Tabla13[[#This Row],[Neto]]/Tabla13[[#This Row],[Bruto]]","v":1},0,2.9,{"$f":"Tabla13[[#This Row],[ud2]]","v":"Kg"}]
["HARINA DE TRIGO",0.5,"Kg",2.4500000000000002,{"$f":"Tabla13[[#This Row],[Ud]]","v":"Kg"},1,1,{"$f":"Tabla13[[#This Row],[Neto]]/Tabla13[[#This Row],[Bruto]]","v":1},{"$f":"1-H135","v":0},{"$f":"(1*D135)/B135","v":4.9000000000000004},{"$f":"Tabla13[[#This Row],[ud2]]","v":"Kg"}]
["HARINA DEL PAÍS",40,"Kg",54.08,{"$f":"Tabla13[[#This Row],[Ud]]","v":"Kg"},1,1,{"$f":"Tabla13[[#This Row],[Neto]]/Tabla13[[#This Row],[Bruto]]","v":1},0,1.3519999999999999,{"$f":"Tabla13[[#This Row],[ud2]]","v":"Kg"}]
["HARINA GRAN FUERZA",1,"Kg",0.624,{"$f":"Tabla13[[#This Row],[Ud]]","v":"Kg"},1,1,{"$f":"Tabla13[[#This Row],[Neto]]/Tabla13[[#This Row],[Bruto]]","v":1},0,0.624,{"$f":"Tabla13[[#This Row],[ud2]]","v":"Kg"}]
["HARINA INTEGRAL",1,"Kg",0.38,{"$f":"Tabla13[[#This Row],[Ud]]","v":"Kg"},1,1,{"$f":"Tabla13[[#This Row],[Neto]]/Tabla13[[#This Row],[Bruto]]","v":1},0,0.38,{"$f":"Tabla13[[#This Row],[ud2]]","v":"Kg"}]
["HARINA SIN GLUTEN",1,"Kg",3.09,{"$f":"Tabla13[[#This Row],[Ud]]","v":"Kg"},1,1,{"$f":"Tabla13[[#This Row],[Neto]]/Tabla13[[#This Row],[Bruto]]","v":1},0,3.09,{"$f":"Tabla13[[#This Row],[ud2]]","v":"Kg"}]
["HELICES VEGETALES",0.5,"Kg",0.96,{"$f":"Tabla13[[#This Row],[Ud]]","v":"Kg"},1,1,{"$f":"Tabla13[[#This Row],[Neto]]/Tabla13[[#This Row],[Bruto]]","v":1},0,1.92,{"$f":"Tabla13[[#This Row],[ud2]]","v":"Kg"}]
["HÍGADO DE POLO",0.45,"Kg",0.78,{"$f":"Tabla13[[#This Row],[Ud]]","v":"Kg"},1,1,{"$f":"Tabla13[[#This Row],[Neto]]/Tabla13[[#This Row],[Bruto]]","v":1},0,1.7333333333333334,{"$f":"Tabla13[[#This Row],[ud2]]","v":"Kg"}]
["HINOJO",0.1,"Kg",0.89,{"$f":"Tabla13[[#This Row],[Ud]]","v":"Kg"},1,1,{"$f":"Tabla13[[#This Row],[Neto]]/Tabla13[[#This Row],[Bruto]]","v":1},0,8.9,{"$f":"Tabla13[[#This Row],[ud2]]","v":"Kg"}]
["HOJALDRE CROISSANT",20,"Kg",2.2890000000000001,{"$f":"Tabla13[[#This Row],[Ud]]","v":"Kg"},1,1,{"$f":"Tabla13[[#This Row],[Neto]]/Tabla13[[#This Row],[Bruto]]","v":1},0,0.11445000000000001,{"$f":"Tabla13[[#This Row],[ud2]]","v":"Kg"}]
["HOJALDRE PLACAS",10,"Kg",3.5419999999999998,{"$f":"Tabla13[[#This Row],[Ud]]","v":"Kg"},1,1,{"$f":"Tabla13[[#This Row],[Neto]]/Tabla13[[#This Row],[Bruto]]","v":1},0,0.35419999999999996,{"$f":"Tabla13[[#This Row],[ud2]]","v":"Kg"}]
["HUEVOS",12,"Und",2.1800000000000002,{"$f":"Tabla13[[#This Row],[Ud]]","v":"Und"},1,1,{"$f":"Tabla13[[#This Row],[Neto]]/Tabla13[[#This Row],[Bruto]]","v":1},0,0.18166666666666667,{"$f":"Tabla13[[#This Row],[ud2]]","v":"Und"}]
["JAMON ",1,"KG",7,{"$f":"Tabla13[[#This Row],[Ud]]","v":"KG"},1,1,{"$f":"G146/F146","v":1},0,{"$f":"IF(B146<1,D146/B146,D146/B146)","v":7},{"$f":"Tabla13[[#This Row],[ud2]]","v":"KG"}]
["JAMON CENTRO",1,"KG",12,{"$f":"Tabla13[[#This Row],[Ud]]","v":"KG"},1,1,{"$f":"G147/F147","v":1},0,{"$f":"IF(B147<1,D147/B147,D147/B147)","v":12},{"$f":"Tabla13[[#This Row],[ud2]]","v":"KG"}]
["KETCHUP",0.3,"Kg",1.17,{"$f":"Tabla13[[#This Row],[Ud]]","v":"Kg"},1,1,{"$f":"Tabla13[[#This Row],[Neto]]/Tabla13[[#This Row],[Bruto]]","v":1},0,{"$f":"(1*D148)/B148","v":3.9},{"$f":"Tabla13[[#This Row],[ud2]]","v":"Kg"}]
["KIWI",1,"Kg",2.34,{"$f":"Tabla13[[#This Row],[Ud]]","v":"Kg"},1,1,{"$f":"Tabla13[[#This Row],[Neto]]/Tabla13[[#This Row],[Bruto]]","v":1},0,{"$f":"(1*D149)/B149","v":2.34},{"$f":"Tabla13[[#This Row],[ud2]]","v":"Kg"}]
["LACÓN COCIDO TORRE DE NÚÑEZ",1,"Kg",3.01,{"$f":"Tabla13[[#This Row],[Ud]]","v":"Kg"},1,1,{"$f":"G150/F150","v":1},0,{"$f":"IF(B150<1,D150/B150,D150/B150)","v":3.01},{"$f":"Tabla13[[#This Row],[ud2]]","v":"Kg"}]
["LACÓN CURADO",1,"Kg",8.9499999999999993,{"$f":"Tabla13[[#This Row],[Ud]]","v":"Kg"},1,1,1,0,8.9499999999999993,{"$f":"Tabla13[[#This Row],[ud2]]","v":"Kg"}]
["LACÓN DE CERDO FRESCO",1,"Kg",3.76,{"$f":"Tabla13[[#This Row],[Ud]]","v":"Kg"},1,1,1,0,3.76,{"$f":"Tabla13[[#This Row],[ud2]]","v":"Kg"}]
["LACÓN SALADO MONTES",1,"Kg",2.95,{"$f":"Tabla13[[#This Row],[Ud]]","v":"Kg"},1,1,1,0,2.95,{"$f":"Tabla13[[#This Row],[ud2]]","v":"Kg"}]
["LANGOSTA",1,"Kg",5.04,{"$f":"Tabla13[[#This Row],[Ud]]","v":"Kg"},1,1,1,0,5.04,{"$f":"Tabla13[[#This Row],[ud2]]","v":"Kg"}]
["LANGOSTINO 20-30",1,"Kg",15,{"$f":"Tabla13[[#This Row],[Ud]]","v":"Kg"},1,1,1,0,15,{"$f":"Tabla13[[#This Row],[ud2]]","v":"Kg"}]
["LANGOSTINO 30/40",1,"Kg",16,{"$f":"Tabla13[[#This Row],[Ud]]","v":"Kg"},1,1,1,0,16,{"$f":"Tabla13[[#This Row],[ud2]]","v":"Kg"}]
["LANGOSTINO 41/50",1,"Kg",14.5,{"$f":"Tabla13[[#This Row],[Ud]]","v":"Kg"},1,1,1,0,14.5,{"$f":"Tabla13[[#This Row],[ud2]]","v":"Kg"}]
["LAUREL",1,"bolsa",0.98799999999999999,{"$f":"Tabla13[[#This Row],[Ud]]","v":"bolsa"},1,0.5,0.5,0.5,0.98799999999999999,{"$f":"Tabla13[[#This Row],[ud2]]","v":"bolsa"}]
["LECHE CONDENSADA ",0.74,"Kg",2.4700000000000002,{"$f":"Tabla13[[#This Row],[Ud]]","v":"Kg"},1,1,1,0,3.3378378378378382,{"$f":"Tabla13[[#This Row],[ud2]]","v":"Kg"}]
["LECHE DELEITE",1,"L",2.5270270270270272,{"$f":"Tabla13[[#This Row],[Ud]]","v":"L"},1,1,1,0,2.5270270270270272,{"$f":"Tabla13[[#This Row],[ud2]]","v":"L"}]
["LECHE EN PÓLVO LA ASTURIANA",1,"Kg",0.69,{"$f":"Tabla13[[#This Row],[Ud]]","v":"Kg"},1,1,1,0,0.69,{"$f":"Tabla13[[#This Row],[ud2]]","v":"Kg"}]
["LECHE RÍO",1,"L",6.95,{"$f":"Tabla13[[#This Row],[Ud]]","v":"L"},1,1,1,0,6.95,{"$f":"Tabla13[[#This Row],[ud2]]","v":"L"}]
["LECHUGA ACHICORIA",1,"KG",0.65,{"$f":"Tabla13[[#This Row],[Ud]]","v":"KG"},1,0.9,0.9,9.9999999999999978E-2,0.65,{"$f":"Tabla13[[#This Row],[ud2]]","v":"KG"}]
["LECHUGA ESCAROLA LIMPIA",1,"por bolsa",1.97,{"$f":"Tabla13[[#This Row],[Ud]]","v":"por bolsa"},1,1,1,0,1.97,{"$f":"Tabla13[[#This Row],[ud2]]","v":"por bolsa"}]
["LECHUGA HOJA ROBLE",1,"UD",0.78,{"$f":"Tabla13[[#This Row],[Ud]]","v":"UD"},1,0.8,0.8,0.19999999999999996,0.78,{"$f":"Tabla13[[#This Row],[ud2]]","v":"UD"}]
["LECHUGA ICEBERG",1,"UD",1.48,{"$f":"Tabla13[[#This Row],[Ud]]","v":"UD"},1,1,1,0,1.48,{"$f":"Tabla13[[#This Row],[ud2]]","v":"UD"}]
["LECHUGA OREJA BURRO",1,"UD",1.248,{"$f":"Tabla13[[#This Row],[Ud]]","v":"UD"},1,0.8,0.8,0.19999999999999996,1.248,{"$f":"Tabla13[[#This Row],[ud2]]","v":"UD"}]
["LECHUGA PAÍS",1,"UD",1.17,{"$f":"Tabla13[[#This Row],[Ud]]","v":"UD"},1,0.9,0.9,9.9999999999999978E-2,1.17,{"$f":"Tabla13[[#This Row],[ud2]]","v":"UD"}]
["LECHUGA RIZA",1,"UD",1.1399999999999999,{"$f":"Tabla13[[#This Row],[Ud]]","v":"UD"},1,0.8,0.8,0.19999999999999996,1.1399999999999999,{"$f":"Tabla13[[#This Row],[ud2]]","v":"UD"}]
["LECHUGA ROMANA",1,"UD",0.57199999999999995,{"$f":"Tabla13[[#This Row],[Ud]]","v":"UD"},1,0.8,0.8,0.19999999999999996,0.57199999999999995,{"$f":"Tabla13[[#This Row],[ud2]]","v":"UD"}]
["LECHUGA TROCADERO",1,"UD",1.1000000000000001,{"$f":"Tabla13[[#This Row],[Ud]]","v":"UD"},1,0.8,0.8,0.19999999999999996,1.1000000000000001,{"$f":"Tabla13[[#This Row],[ud2]]","v":"UD"}]
["LENGUADO N2 ",1,"KG",13.662000000000001,{"$f":"Tabla13[[#This Row],[Ud]]","v":"KG"},1,0.8,0.8,0.19999999999999996,13.662000000000001,{"$f":"Tabla13[[#This Row],[ud2]]","v":"KG"}]
["LENGUADO Nº3 CONJELADO",1,"KG",9.8970000000000002,{"$f":"Tabla13[[#This Row],[Ud]]","v":"KG"},1,0.5,0.5,0.5,9.8970000000000002,{"$f":"Tabla13[[#This Row],[ud2]]","v":"KG"}]
["LENGUAS DE TERNERA",1,"KG",6.835106382978724,{"$f":"Tabla13[[#This Row],[Ud]]","v":"KG"},1,0.4,0.4,0.6,6.835106382978724,{"$f":"Tabla13[[#This Row],[ud2]]","v":"KG"}]
["LENTEJA PARDINA",1,"KG",5.95,{"$f":"Tabla13[[#This Row],[Ud]]","v":"KG"},1,0.8,0.8,0.19999999999999996,5.95,{"$f":"Tabla13[[#This Row],[ud2]]","v":"KG"}]
["LEVADURA",1,"KG",1,{"$f":"Tabla13[[#This Row],[Ud]]","v":"KG"},1,1,1,0,1,{"$f":"Tabla13[[#This Row],[ud2]]","v":"KG"}]
["LEVADURA PRENSADA",1,"KG",3,{"$f":"Tabla13[[#This Row],[Ud]]","v":"KG"},1,1,1,0,3,{"$f":"Tabla13[[#This Row],[ud2]]","v":"KG"}]
["LIEBRE",1,"Kg",6.75,{"$f":"Tabla13[[#This Row],[Ud]]","v":"Kg"},2,1.3,0.65,0.35,6.75,{"$f":"Tabla13[[#This Row],[ud2]]","v":"Kg"}]
["LIMÓN",1,"KG",1.1299999999999999,{"$f":"Tabla13[[#This Row],[Ud]]","v":"KG"},1,0.7,0.7,0.30000000000000004,1.1299999999999999,{"$f":"Tabla13[[#This Row],[ud2]]","v":"KG"}]
["LOMBARDA",1,"KG",1.56,{"$f":"Tabla13[[#This Row],[Ud]]","v":"KG"},1,0.5,0.5,0.5,1.56,{"$f":"Tabla13[[#This Row],[ud2]]","v":"KG"}]
["LOMO ADOBADO CERDO",1,"KG",4.8099999999999996,{"$f":"Tabla13[[#This Row],[Ud]]","v":"KG"},1,1,1,0,4.8099999999999996,{"$f":"Tabla13[[#This Row],[ud2]]","v":"KG"}]
["LOMO BAJO DE TERNERA (CON SOLOMILLO)",1,"KG",10.35,{"$f":"Tabla13[[#This Row],[Ud]]","v":"KG"},1,0.8,0.8,0.19999999999999996,10.35,{"$f":"Tabla13[[#This Row],[ud2]]","v":"KG"}]
["LOMO DE ATÚN CONGELADO",1,"KG",9.3629999999999995,{"$f":"Tabla13[[#This Row],[Ud]]","v":"KG"},1,1,1,0,9.3629999999999995,{"$f":"Tabla13[[#This Row],[ud2]]","v":"KG"}]
["LOMO DE BACALAO DESALADO 300/400 ",1,"KG",9.3420000000000005,{"$f":"Tabla13[[#This Row],[Ud]]","v":"KG"},1,1,1,0,9.3420000000000005,{"$f":"Tabla13[[#This Row],[ud2]]","v":"KG"}]
["LOMO DE CERDO",1,"KG",5.41,{"$f":"Tabla13[[#This Row],[Ud]]","v":"KG"},1,1,1,0,5.41,{"$f":"Tabla13[[#This Row],[ud2]]","v":"KG"}]
["LOMO DE CIERVO",1,"KG",16.5,{"$f":"Tabla13[[#This Row],[Ud]]","v":"KG"},1,1,1,0,16.5,{"$f":"Tabla13[[#This Row],[ud2]]","v":"KG"}]
["LOMO EMBUCHADO CULAR",1,"KG",9.9499999999999993,{"$f":"Tabla13[[#This Row],[Ud]]","v":"KG"},1,1,1,0,9.9499999999999993,{"$f":"Tabla13[[#This Row],[ud2]]","v":"KG"}]
["LOMO IBÉRICO BELLOTA",1,"KG",7,{"$f":"Tabla13[[#This Row],[Ud]]","v":"KG"},1,1,1,0,7,{"$f":"Tabla13[[#This Row],[ud2]]","v":"KG"}]
["LUBINA 400-600",1,"KG",8,{"$f":"Tabla13[[#This Row],[Ud]]","v":"KG"},1,1,1,0,8,{"$f":"Tabla13[[#This Row],[ud2]]","v":"KG"}]
["LUBINA SALVAJE",1,"KG",40,{"$f":"Tabla13[[#This Row],[Ud]]","v":"KG"},1,0.6,0.6,0.4,40,{"$f":"Tabla13[[#This Row],[ud2]]","v":"KG"}]
["LUBRIGANTE",1,"KG",22,{"$f":"Tabla13[[#This Row],[Ud]]","v":"KG"},1,1,1,0,22,{"$f":"Tabla13[[#This Row],[ud2]]","v":"KG"}]
["LUBRIGANTE CONGELADO EAST COAST, 300 GRS, UD.",1,"KG",8,{"$f":"Tabla13[[#This Row],[Ud]]","v":"KG"},1,1,1,0,8,{"$f":"Tabla13[[#This Row],[ud2]]","v":"KG"}]
["LUBRIGANTE CRUDO 450-500 GR 11 PIEZAS",1,"KG",16.600000000000001,{"$f":"Tabla13[[#This Row],[Ud]]","v":"KG"},1,1,1,0,16.600000000000001,{"$f":"Tabla13[[#This Row],[ud2]]","v":"KG"}]
["LUBRIGANTE DA RÍA GALEGA",0.3,"KG",37.799999999999997,{"$f":"Tabla13[[#This Row],[Ud]]","v":"KG"},1,1,1,0,126,{"$f":"Tabla13[[#This Row],[ud2]]","v":"KG"}]
["LYCHEES",1,"KG",3.9,{"$f":"Tabla13[[#This Row],[Ud]]","v":"KG"},1,1,1,0,3.9,{"$f":"Tabla13[[#This Row],[ud2]]","v":"KG"}]
["MAÍZ DULCE",1,"KG",3,{"$f":"Tabla13[[#This Row],[Ud]]","v":"KG"},1,1,1,0,3,{"$f":"Tabla13[[#This Row],[ud2]]","v":"KG"}]
["MAIZENA",1,"KG",3.1160000000000001,{"$f":"Tabla13[[#This Row],[Ud]]","v":"KG"},1,1,1,0,3.1160000000000001,{"$f":"Tabla13[[#This Row],[ud2]]","v":"KG"}]
["MANDARINA CLEMENTINA",1,"KG",1.38,{"$f":"Tabla13[[#This Row],[Ud]]","v":"KG"},1,1,1,0,1.38,{"$f":"Tabla13[[#This Row],[ud2]]","v":"KG"}]
["MANGO",1,"KG",2,{"$f":"Tabla13[[#This Row],[Ud]]","v":"KG"},1,0.8,0.8,{"$f":"1-H199","v":0.19999999999999996},2,{"$f":"Tabla13[[#This Row],[ud2]]","v":"KG"}]
["MANTECA DE CERDO",1,"KG",2,{"$f":"Tabla13[[#This Row],[Ud]]","v":"KG"},1,1,1,0,2,{"$f":"Tabla13[[#This Row],[ud2]]","v":"KG"}]
["MANTEQUILLA PASCUAL",1,"KG",3.9975999999999998,{"$f":"Tabla13[[#This Row],[Ud]]","v":"KG"},1,1,1,0,3.9975999999999998,{"$f":"Tabla13[[#This Row],[ud2]]","v":"KG"}]
["MANZANA ENANA EN ALMÍBAR",1,"KG",0.2,{"$f":"Tabla13[[#This Row],[Ud]]","v":"KG"},1,1,{"$f":"G202/F202","v":1},0,0.2,{"$f":"Tabla13[[#This Row],[ud2]]","v":"KG"}]
["MANZANA GOLDEN",1,"KG",1.08,{"$f":"Tabla13[[#This Row],[Ud]]","v":"KG"},1,1,1,0,1.08,{"$f":"Tabla13[[#This Row],[ud2]]","v":"KG"}]
["MANZANA REINETA",1,"KG",1.69,{"$f":"Tabla13[[#This Row],[Ud]]","v":"KG"},1,1,1,0,1.69,{"$f":"Tabla13[[#This Row],[ud2]]","v":"KG"}]
["MANZANA ROJA",1,"KG",1.63,{"$f":"Tabla13[[#This Row],[Ud]]","v":"KG"},1,1,1,0,1.63,{"$f":"Tabla13[[#This Row],[ud2]]","v":"KG"}]
["MANZANA VERDE",1,"KG",2.17,{"$f":"Tabla13[[#This Row],[Ud]]","v":"KG"},1,1,1,0,2.17,{"$f":"Tabla13[[#This Row],[ud2]]","v":"KG"}]
["MARGARINA",1,"KG",2,{"$f":"Tabla13[[#This Row],[Ud]]","v":"KG"},1,1,1,0,2,{"$f":"Tabla13[[#This Row],[ud2]]","v":"KG"}]
["MEJILLÓN",1,"KG",2.5,{"$f":"Tabla13[[#This Row],[Ud]]","v":"KG"},1,0.35,0.35,0.65,2.5,{"$f":"Tabla13[[#This Row],[ud2]]","v":"KG"}]
["MEJILLÓN GRANDE",1,"KG",1.85,{"$f":"Tabla13[[#This Row],[Ud]]","v":"KG"},1,0.45,0.45,0.55000000000000004,1.85,{"$f":"Tabla13[[#This Row],[ud2]]","v":"KG"}]
["MELOCOTÓN",1,"KG",1.29,{"$f":"Tabla13[[#This Row],[Ud]]","v":"KG"},1,0.95,0.95,5.0000000000000044E-2,1.29,{"$f":"Tabla13[[#This Row],[ud2]]","v":"KG"}]
["MELÓN",1,"KG",2.25,{"$f":"Tabla13[[#This Row],[Ud]]","v":"KG"},1,0.8,0.8,0.19999999999999996,2.25,{"$f":"Tabla13[[#This Row],[ud2]]","v":"KG"}]
["MEMBRILLO",1,"KG",3.8,{"$f":"Tabla13[[#This Row],[Ud]]","v":"KG"},1,1,1,0,3.8,{"$f":"Tabla13[[#This Row],[ud2]]","v":"KG"}]
["MERLUZA AUSTRAL +2,5 KG",1,"KG",12,{"$f":"Tabla13[[#This Row],[Ud]]","v":"KG"},1,0.65,0.65,0.35,12,{"$f":"Tabla13[[#This Row],[ud2]]","v":"KG"}]
["MERLUZA CONGELADA PESCANOVA",1,"KG",7.75,{"$f":"Tabla13[[#This Row],[Ud]]","v":"KG"},2.95,1.99,0.67457627118644059,0.32542372881355941,{"$f":"IF(B214<1,D214/B214,D214/B214)","v":7.75},{"$f":"Tabla13[[#This Row],[ud2]]","v":"KG"}]
["MERLUZA DEL PINCHO ",1,"KG",6.4,{"$f":"Tabla13[[#This Row],[Ud]]","v":"KG"},1,0.6,0.6,0.4,6.4,{"$f":"Tabla13[[#This Row],[ud2]]","v":"KG"}]
["MERLUZA PINCHO 2,5 -3",1,"KG",6.9,{"$f":"Tabla13[[#This Row],[Ud]]","v":"KG"},1,0.995,0.995,5.0000000000000044E-3,6.9,{"$f":"Tabla13[[#This Row],[ud2]]","v":"KG"}]
["MERO",1,"KG",27,{"$f":"Tabla13[[#This Row],[Ud]]","v":"KG"},1,0.75,0.75,0.25,27,{"$f":"Tabla13[[#This Row],[ud2]]","v":"KG"}]
["MICROTULIPA DE CHOCOLATE",1,"KG",0.10823529411764705,{"$f":"Tabla13[[#This Row],[Ud]]","v":"KG"},1,1,1,0,0.10823529411764705,{"$f":"Tabla13[[#This Row],[ud2]]","v":"KG"}]
["MIGAS DE BACALAO",1,"KG",6.96,{"$f":"Tabla13[[#This Row],[Ud]]","v":"KG"},1,1,1,0,6.96,{"$f":"Tabla13[[#This Row],[ud2]]","v":"KG"}]
["MOLLEJAS DE CORDERO",1,"KG",10.67,{"$f":"Tabla13[[#This Row],[Ud]]","v":"KG"},1,1,1,0,10.67,{"$f":"Tabla13[[#This Row],[ud2]]","v":"KG"}]
["MORAS",1,"KG",5.75,{"$f":"Tabla13[[#This Row],[Ud]]","v":"KG"},1,1,1,0,5.75,{"$f":"Tabla13[[#This Row],[ud2]]","v":"KG"}]
["MORCILLA ASTURIANA",1,"KG",3,{"$f":"Tabla13[[#This Row],[Ud]]","v":"KG"},1,1,1,0,3,{"$f":"Tabla13[[#This Row],[ud2]]","v":"KG"}]
["MORROS SALADOS",1,"KG",2.15,{"$f":"Tabla13[[#This Row],[Ud]]","v":"KG"},1,1,1,0,2.15,{"$f":"Tabla13[[#This Row],[ud2]]","v":"KG"}]
["MOSTAZA DIJON ",0.215,"KG",8.8372093023255811,{"$f":"Tabla13[[#This Row],[Ud]]","v":"KG"},1,1,1,0,41.103299080584101,{"$f":"Tabla13[[#This Row],[ud2]]","v":"KG"}]
["MOSTAZA DIJON ANTIGUA ",0.215,"KG",8.8372093023255811,{"$f":"Tabla13[[#This Row],[Ud]]","v":"KG"},1,1,1,0,41.103299080584101,{"$f":"Tabla13[[#This Row],[ud2]]","v":"KG"}]
["MOSTAZA KRAFT",0.215,"KG",1,{"$f":"Tabla13[[#This Row],[Ud]]","v":"KG"},1,1,1,0,4.6511627906976747,{"$f":"Tabla13[[#This Row],[ud2]]","v":"KG"}]
["MUSLITO DE POLO",0.215,"KG",2.85,{"$f":"Tabla13[[#This Row],[Ud]]","v":"KG"},1,1,1,0,13.255813953488373,{"$f":"Tabla13[[#This Row],[ud2]]","v":"KG"}]
["MUSLITOS DE GALLO CONFITADOS",1,"KG",29.5,{"$f":"Tabla13[[#This Row],[Ud]]","v":"KG"},1,1,1,0,29.5,{"$f":"Tabla13[[#This Row],[ud2]]","v":"KG"}]
["MUSLO DE POLLO",1,"KG",2.34,{"$f":"Tabla13[[#This Row],[Ud]]","v":"KG"},1,1,1,0,2.34,{"$f":"Tabla13[[#This Row],[ud2]]","v":"KG"}]
["MUSLOS DE PATO CONFITADOS",1,"KG",5.79,{"$f":"Tabla13[[#This Row],[Ud]]","v":"KG"},1,1,1,0,5.79,{"$f":"Tabla13[[#This Row],[ud2]]","v":"KG"}]
["NABIZAS",1,"por mada",1.87,{"$f":"Tabla13[[#This Row],[Ud]]","v":"por mada"},1,0.9,0.9,9.9999999999999978E-2,1.87,{"$f":"Tabla13[[#This Row],[ud2]]","v":"por mada"}]
["NARANJA BOUQUET",1,"Kg",14.42,{"$f":"Tabla13[[#This Row],[Ud]]","v":"Kg"},1,1,1,0,14.42,{"$f":"Tabla13[[#This Row],[ud2]]","v":"Kg"}]
["NARANJA ZUMO",1,"Kg",0.99,{"$f":"Tabla13[[#This Row],[Ud]]","v":"Kg"},1,0.7,0.7,0.30000000000000004,0.99,{"$f":"Tabla13[[#This Row],[ud2]]","v":"Kg"}]
["NATA ASTURIANA LÍQUIDA",1,"L",2.99,{"$f":"Tabla13[[#This Row],[Ud]]","v":"L"},1,1,1,0,2.99,{"$f":"Tabla13[[#This Row],[ud2]]","v":"L"}]
["NATA CULINARE DEBIC",1,"L",4.5999999999999996,{"$f":"Tabla13[[#This Row],[Ud]]","v":"L"},1,1,1,0,4.5999999999999996,{"$f":"Tabla13[[#This Row],[ud2]]","v":"L"}]
["NATA DEBIC CULINARIA",1,"L",3.2,{"$f":"Tabla13[[#This Row],[Ud]]","v":"L"},1,1,1,0,3.2,{"$f":"Tabla13[[#This Row],[ud2]]","v":"L"}]
["NATA FEIRACO",1,"L",3.9420000000000002,{"$f":"Tabla13[[#This Row],[Ud]]","v":"L"},1,1,1,0,3.9420000000000002,{"$f":"Tabla13[[#This Row],[ud2]]","v":"L"}]
["NÉCORA",1,"KG",10,{"$f":"Tabla13[[#This Row],[Ud]]","v":"KG"},1,1,1,0,10,{"$f":"Tabla13[[#This Row],[ud2]]","v":"KG"}]
["NECTALINAS",1,"KG",1.19,{"$f":"Tabla13[[#This Row],[Ud]]","v":"KG"},1,1,1,0,1.19,{"$f":"Tabla13[[#This Row],[ud2]]","v":"KG"}]
["NÍSCALOS",1,"KG",10,{"$f":"Tabla13[[#This Row],[Ud]]","v":"KG"},1,1,1,0,10,{"$f":"Tabla13[[#This Row],[ud2]]","v":"KG"}]
["NORI EN COPOS",1,"KG",27,{"$f":"Tabla13[[#This Row],[Ud]]","v":"KG"},1,1,1,0,27,{"$f":"Tabla13[[#This Row],[ud2]]","v":"KG"}]
["NUECES INDIAS",1,"KG",7.25,{"$f":"Tabla13[[#This Row],[Ud]]","v":"KG"},1,1,1,0,7.25,{"$f":"Tabla13[[#This Row],[ud2]]","v":"KG"}]
["NUEZ MOSCADA MOLIDA",1,"KG",26.08,{"$f":"Tabla13[[#This Row],[Ud]]","v":"KG"},1,1,1,0,26.08,{"$f":"Tabla13[[#This Row],[ud2]]","v":"KG"}]
["ORÉGANO",1,"KG",7.92,{"$f":"Tabla13[[#This Row],[Ud]]","v":"KG"},1,1,1,0,7.92,{"$f":"Tabla13[[#This Row],[ud2]]","v":"KG"}]
["OREJA CERDO",1,"KG",9.58,{"$f":"Tabla13[[#This Row],[Ud]]","v":"KG"},1,1,1,0,9.58,{"$f":"Tabla13[[#This Row],[ud2]]","v":"KG"}]
["OREJA SALADA",1,"KG",5.45,{"$f":"Tabla13[[#This Row],[Ud]]","v":"KG"},1,1,1,0,5.45,{"$f":"Tabla13[[#This Row],[ud2]]","v":"KG"}]
["ORTIGAS AL NATURAL",1,"KG",2.4500000000000002,{"$f":"Tabla13[[#This Row],[Ud]]","v":"KG"},1,1,1,0,2.4500000000000002,{"$f":"Tabla13[[#This Row],[ud2]]","v":"KG"}]
["PALETA DE JABALÍ S/H",1,"KG",1,{"$f":"Tabla13[[#This Row],[Ud]]","v":"KG"},1,1,1,0,1,{"$f":"Tabla13[[#This Row],[ud2]]","v":"KG"}]
["PALETA IBÉRICA BELLOTA",1,"por pieza",8.26,{"$f":"Tabla13[[#This Row],[Ud]]","v":"por pieza"},1,1,1,0,8.26,{"$f":"Tabla13[[#This Row],[ud2]]","v":"por pieza"}]
["PALETILLA LECHAL 500-600 GR",1,"KG",23.5,{"$f":"Tabla13[[#This Row],[Ud]]","v":"KG"},1,1,1,0,23.5,{"$f":"Tabla13[[#This Row],[ud2]]","v":"KG"}]
["PAN ARTIS INTEGRAL ",0.6,"KG",3.75,{"$f":"Tabla13[[#This Row],[Ud]]","v":"KG"},1,1,1,0,6.25,{"$f":"Tabla13[[#This Row],[ud2]]","v":"KG"}]
["PAN ARTIS NUECES ",3,"KG",3.88,{"$f":"Tabla13[[#This Row],[Ud]]","v":"KG"},1,1,1,0,1.2933333333333332,{"$f":"Tabla13[[#This Row],[ud2]]","v":"KG"}]
["PAN DE MOLDE",0.35,"por paquete",1.4,{"$f":"Tabla13[[#This Row],[Ud]]","v":"por paquete"},1,1,1,0,4,{"$f":"Tabla13[[#This Row],[ud2]]","v":"por paquete"}]
["PAN RALLADO",0.35,"KG",0.60199999999999998,{"$f":"Tabla13[[#This Row],[Ud]]","v":"KG"},1,1,1,0,1.72,{"$f":"Tabla13[[#This Row],[ud2]]","v":"KG"}]
["PANCETA CON COSTILLA",0.25,"KG",5,{"$f":"Tabla13[[#This Row],[Ud]]","v":"KG"},1,1,1,0,20,{"$f":"Tabla13[[#This Row],[ud2]]","v":"KG"}]
["PANCETA CURADA IBÉRICA BELLOTA",1,"KG",3.45,{"$f":"Tabla13[[#This Row],[Ud]]","v":"KG"},1,1,1,0,3.45,{"$f":"Tabla13[[#This Row],[ud2]]","v":"KG"}]
["PANCETA IBÉRICA SALADA",1,"KG",2.75,{"$f":"Tabla13[[#This Row],[Ud]]","v":"KG"},1,1,1,0,2.75,{"$f":"Tabla13[[#This Row],[ud2]]","v":"KG"}]
["PASAS SULTANAS",1,"KG",1.95,{"$f":"Tabla13[[#This Row],[Ud]]","v":"KG"},1,1,1,0,1.95,{"$f":"Tabla13[[#This Row],[ud2]]","v":"KG"}]
["PASTA BRICK",0.25,"KG",2.5,{"$f":"Tabla13[[#This Row],[Ud]]","v":"KG"},1,1,1,0,10,{"$f":"Tabla13[[#This Row],[ud2]]","v":"KG"}]
["PASTA FILO",0.17,"KG",4,{"$f":"Tabla13[[#This Row],[Ud]]","v":"KG"},1,1,1,0,23.52941176470588,{"$f":"Tabla13[[#This Row],[ud2]]","v":"KG"}]
["PATATA",0.02,"KG",0.6,{"$f":"Tabla13[[#This Row],[Ud]]","v":"KG"},1,1,1,0,30,{"$f":"Tabla13[[#This Row],[ud2]]","v":"KG"}]
["PATATA NUEVA",1,"KG",0.9,{"$f":"Tabla13[[#This Row],[Ud]]","v":"KG"},1,0.8,0.8,0.19999999999999996,0.9,{"$f":"Tabla13[[#This Row],[ud2]]","v":"KG"}]
["PECHUGA POLLO",1,"KG",5.5,{"$f":"Tabla13[[#This Row],[Ud]]","v":"KG"},1,1,1,{"$f":"1-H263","v":0},5.5,{"$f":"Tabla13[[#This Row],[ud2]]","v":"KG"}]
["PEDRO XIMÉNEZ OSBORNE 750 ML",1,"L",6.79,{"$f":"Tabla13[[#This Row],[Ud]]","v":"L"},1,1,1,0,6.79,{"$f":"Tabla13[[#This Row],[ud2]]","v":"L"}]
["PEPINILLOS EN VINAGRE",0.75,"KG",8.6,{"$f":"Tabla13[[#This Row],[Ud]]","v":"KG"},1,1,1,0,11.466666666666667,{"$f":"Tabla13[[#This Row],[ud2]]","v":"KG"}]
["PERA CONFERENCIA",1,"KG",2,{"$f":"Tabla13[[#This Row],[Ud]]","v":"KG"},1,1,{"$f":"G266/F266","v":1},0,2,{"$f":"Tabla13[[#This Row],[ud2]]","v":"KG"}]
["PERCEBE",1,"KG",25,{"$f":"Tabla13[[#This Row],[Ud]]","v":"KG"},1,1,1,0,25,{"$f":"Tabla13[[#This Row],[ud2]]","v":"KG"}]
["PERDIZ ROJA",1,"KG",13,{"$f":"Tabla13[[#This Row],[Ud]]","v":"KG"},1,1,1,0,13,{"$f":"Tabla13[[#This Row],[ud2]]","v":"KG"}]
["PEREJIL",1,"kg",4.95,{"$f":"Tabla13[[#This Row],[Ud]]","v":"kg"},1,1,1,0,4.95,{"$f":"Tabla13[[#This Row],[ud2]]","v":"kg"}]
["PEZ ESPADA LOMOS CONGELADOS",1,"KG",11.23,{"$f":"Tabla13[[#This Row],[Ud]]","v":"KG"},1,0.94,0.94,6.0000000000000053E-2,11.23,{"$f":"Tabla13[[#This Row],[ud2]]","v":"KG"}]
["PIERNA CORDERO",1,"KG",14,{"$f":"Tabla13[[#This Row],[Ud]]","v":"KG"},1,0.4,0.4,0.6,14,{"$f":"Tabla13[[#This Row],[ud2]]","v":"KG"}]
["PIMENTÓN DULCE",1,"KG",5.95,{"$f":"Tabla13[[#This Row],[Ud]]","v":"KG"},1,1,1,0,5.95,{"$f":"Tabla13[[#This Row],[ud2]]","v":"KG"}]
["PIMIENTA NEGRA ",1,"KG",5.7,{"$f":"Tabla13[[#This Row],[Ud]]","v":"KG"},1,1,1,0,5.7,{"$f":"Tabla13[[#This Row],[ud2]]","v":"KG"}]
["PIMIENTA VERDE",0.04,"KG",17.439560439560438,{"$f":"Tabla13[[#This Row],[Ud]]","v":"KG"},1,1,1,0,435.98901098901092,{"$f":"Tabla13[[#This Row],[ud2]]","v":"KG"}]
["PIMIENTO CHORICERO",0.04,"KG",1.5,{"$f":"Tabla13[[#This Row],[Ud]]","v":"KG"},1,1,1,0,37.5,{"$f":"Tabla13[[#This Row],[ud2]]","v":"KG"}]
["PIMIENTO DE PIQUILLO SECO",0.7,"KG",22.75,{"$f":"Tabla13[[#This Row],[Ud]]","v":"KG"},1,1,1,0,32.5,{"$f":"Tabla13[[#This Row],[ud2]]","v":"KG"}]
["PIMIENTO ENTERO RELLENAR PÍBER",1,"KG",2.0556666666666668,{"$f":"Tabla13[[#This Row],[Ud]]","v":"KG"},1,1,1,0,2.0556666666666668,{"$f":"Tabla13[[#This Row],[ud2]]","v":"KG"}]
["PIMIENTO ITALIANO VERDE",1,"KG",1.8,{"$f":"Tabla13[[#This Row],[Ud]]","v":"KG"},1,1,1,0,{"$f":"IF(B278<1,D278/B278,D278/B278)","v":1.8},{"$f":"Tabla13[[#This Row],[ud2]]","v":"KG"}]
["PIMIENTO MORRÓN ROJO",1,"KG",1.29,{"$f":"Tabla13[[#This Row],[Ud]]","v":"KG"},1,1,1,0,1.29,{"$f":"Tabla13[[#This Row],[ud2]]","v":"KG"}]
["PIMIENTO MORRÓN VERDE",1,"KG",2.1800000000000002,{"$f":"Tabla13[[#This Row],[Ud]]","v":"KG"},1,1,1,0,2.1800000000000002,{"$f":"Tabla13[[#This Row],[ud2]]","v":"KG"}]
["PIMIENTO ROJO",1,"KG",2.27,{"$f":"Tabla13[[#This Row],[Ud]]","v":"KG"},1,1,1,0,2.27,{"$f":"Tabla13[[#This Row],[ud2]]","v":"KG"}]
["PIMIENTO VERDE",1,"KG",1.8,{"$f":"Tabla13[[#This Row],[Ud]]","v":"KG"},1,1,1,0,1.8,{"$f":"Tabla13[[#This Row],[ud2]]","v":"KG"}]
["PIÑA",1,"KG",2.79,{"$f":"Tabla13[[#This Row],[Ud]]","v":"KG"},1,1,1,0,2.79,{"$f":"Tabla13[[#This Row],[ud2]]","v":"KG"}]
["PIÑONES LA REIGOSA CRUDO ",1,"KG",30,{"$f":"Tabla13[[#This Row],[Ud]]","v":"KG"},1,0.35,0.35,0.65,30,{"$f":"Tabla13[[#This Row],[ud2]]","v":"KG"}]
["PLÁTANOS",1,"KG",1.3,{"$f":"Tabla13[[#This Row],[Ud]]","v":"KG"},1,0.5,0.5,0.5,1.3,{"$f":"Tabla13[[#This Row],[ud2]]","v":"KG"}]
["POLENTA ",1,"KG",2.33,{"$f":"Tabla13[[#This Row],[Ud]]","v":"KG"},1,1,1,0,2.33,{"$f":"Tabla13[[#This Row],[ud2]]","v":"KG"}]
["POLLO CAMPERO",1,"KG",5.75,{"$f":"Tabla13[[#This Row],[Ud]]","v":"KG"},1,0.9,0.9,9.9999999999999978E-2,5.75,{"$f":"Tabla13[[#This Row],[ud2]]","v":"KG"}]
["POLLO ENTERO",1,"KG",3.5,{"$f":"Tabla13[[#This Row],[Ud]]","v":"KG"},1,0.9,0.9,9.9999999999999978E-2,3.5,{"$f":"Tabla13[[#This Row],[ud2]]","v":"KG"}]
["POLLO PICANTÓN, 1 UD",1,"ud",2.25,{"$f":"Tabla13[[#This Row],[Ud]]","v":"ud"},1,0.9,0.9,9.9999999999999978E-2,2.25,{"$f":"Tabla13[[#This Row],[ud2]]","v":"ud"}]
["PRESA IBÉRICA BELLOTA",1,"KG",14.605499999999999,{"$f":"Tabla13[[#This Row],[Ud]]","v":"KG"},1,1,1,0,14.605499999999999,{"$f":"Tabla13[[#This Row],[ud2]]","v":"KG"}]
["PUERROS",1,"KG",1.04,{"$f":"Tabla13[[#This Row],[Ud]]","v":"KG"},1,0.8,0.8,0.19999999999999996,1.04,{"$f":"Tabla13[[#This Row],[ud2]]","v":"KG"}]
["PULPO CONGELADO",1,"KG",16.600000000000001,{"$f":"Tabla13[[#This Row],[Ud]]","v":"KG"},1,1,1,0,16.600000000000001,{"$f":"Tabla13[[#This Row],[ud2]]","v":"KG"}]
["PULPO GALLEGO 1-2KG",2,"KG",13.93,{"$f":"Tabla13[[#This Row],[Ud]]","v":"KG"},1,1,1,0,6.9649999999999999,{"$f":"Tabla13[[#This Row],[ud2]]","v":"KG"}]
["Q. BARRA EDAM OLDENBURGUER",0.4,"KG",6.19,{"$f":"Tabla13[[#This Row],[Ud]]","v":"KG"},1,1,1,0,15.475,{"$f":"Tabla13[[#This Row],[ud2]]","v":"KG"}]
["Q. FRESCO O VENTERO ",1,"KG",5.7720000000000002,{"$f":"Tabla13[[#This Row],[Ud]]","v":"KG"},1,1,1,0,5.7720000000000002,{"$f":"Tabla13[[#This Row],[ud2]]","v":"KG"}]
["Q. MARCARPONE ",1,"KG",4,{"$f":"Tabla13[[#This Row],[Ud]]","v":"KG"},1,1,1,0,4,{"$f":"Tabla13[[#This Row],[ud2]]","v":"KG"}]
["Q. MEZCLA SEMICURADO MEDIO ",1,"KG",13.26,{"$f":"Tabla13[[#This Row],[Ud]]","v":"KG"},1,1,1,0,13.26,{"$f":"Tabla13[[#This Row],[ud2]]","v":"KG"}]
["Q. OVEJA CURADO ALDAN MEDIO",0.5,"KG",4.04,{"$f":"Tabla13[[#This Row],[Ud]]","v":"KG"},1,1,1,0,8.08,{"$f":"Tabla13[[#This Row],[ud2]]","v":"KG"}]
["QUEIXO PARMESANO REGGIANO ",1,"KG",12.584,{"$f":"Tabla13[[#This Row],[Ud]]","v":"KG"},1,1,1,0,12.584,{"$f":"Tabla13[[#This Row],[ud2]]","v":"KG"}]
["QUEIXO TETILLA D.O. OURO VAL KG",1,"KG",10.85,{"$f":"Tabla13[[#This Row],[Ud]]","v":"KG"},1,1,1,0,10.85,{"$f":"Tabla13[[#This Row],[ud2]]","v":"KG"}]
["QUEIXO UNTAR VIKING TARRINA",1,"KG",7.23,{"$f":"Tabla13[[#This Row],[Ud]]","v":"KG"},1,1,1,0,7.23,{"$f":"Tabla13[[#This Row],[ud2]]","v":"KG"}]
["QUESO  S.SIMÓN",1,"KG",14.83,{"$f":"Tabla13[[#This Row],[Ud]]","v":"KG"},1,1,1,0,14.83,{"$f":"Tabla13[[#This Row],[ud2]]","v":"KG"}]
["QUESO ARZÚA ULLOA ",1,"KG",9.49,{"$f":"Tabla13[[#This Row],[Ud]]","v":"KG"},1,1,1,0,9.49,{"$f":"Tabla13[[#This Row],[ud2]]","v":"KG"}]
["QUESO AZUL",0.45,"KG",4.07,{"$f":"Tabla13[[#This Row],[Ud]]","v":"KG"},1,1,1,0,9.0444444444444443,{"$f":"Tabla13[[#This Row],[ud2]]","v":"KG"}]
["QUESO BRIE ",1,"KG",6.3959999999999999,{"$f":"Tabla13[[#This Row],[Ud]]","v":"KG"},1,1,1,0,6.3959999999999999,{"$f":"Tabla13[[#This Row],[ud2]]","v":"KG"}]
["QUESO CABRA FRESCO EL CASERÍO",1,"KG",8.31,{"$f":"Tabla13[[#This Row],[Ud]]","v":"KG"},1,1,1,0,8.31,{"$f":"Tabla13[[#This Row],[ud2]]","v":"KG"}]
["QUESO CABRA RULO PRESIDENT ",0.25,"KG",2.4500000000000002,{"$f":"Tabla13[[#This Row],[Ud]]","v":"KG"},1,1,1,0,9.8000000000000007,{"$f":"Tabla13[[#This Row],[ud2]]","v":"KG"}]
["QUESO CABRALES D.O. KG",0.47,"KG",13.09,{"$f":"Tabla13[[#This Row],[Ud]]","v":"KG"},1,1,1,0,27.851063829787236,{"$f":"Tabla13[[#This Row],[ud2]]","v":"KG"}]
["QUESO FILADELFÍA ",1,"KG",6.63,{"$f":"Tabla13[[#This Row],[Ud]]","v":"KG"},1,1,1,0,6.63,{"$f":"Tabla13[[#This Row],[ud2]]","v":"KG"}]
["QUESO GRANA PADANO CUÑA ",0.45,"KG",5.1479999999999997,{"$f":"Tabla13[[#This Row],[Ud]]","v":"KG"},1,1,1,0,11.44,{"$f":"Tabla13[[#This Row],[ud2]]","v":"KG"}]
["QUESO GRUYÉRE, ANACO ",0.24,"KG",3.03,{"$f":"Tabla13[[#This Row],[Ud]]","v":"KG"},1,1,1,0,12.625,{"$f":"Tabla13[[#This Row],[ud2]]","v":"KG"}]
["QUESO IDIAZABAL ",0.25,"KG",3.95,{"$f":"Tabla13[[#This Row],[Ud]]","v":"KG"},1,1,1,0,15.8,{"$f":"Tabla13[[#This Row],[ud2]]","v":"KG"}]
["QUESO MANCHEGO",1,"KG",13.79,{"$f":"Tabla13[[#This Row],[Ud]]","v":"KG"},1,1,1,0,13.79,{"$f":"Tabla13[[#This Row],[ud2]]","v":"KG"}]
["QUESO MASCARPONE QUESCREME ",2,"KG",17.472000000000001,{"$f":"Tabla13[[#This Row],[Ud]]","v":"KG"},1,1,1,0,8.7360000000000007,{"$f":"Tabla13[[#This Row],[ud2]]","v":"KG"}]
["QUESO MOZZARELLA BARRA OLDENBURGUER",1,"KG",12.48,{"$f":"Tabla13[[#This Row],[Ud]]","v":"KG"},1,1,1,0,12.48,{"$f":"Tabla13[[#This Row],[ud2]]","v":"KG"}]
["QUESO PARMEGGIANO ",0.25,"KG",2.38,{"$f":"Tabla13[[#This Row],[Ud]]","v":"KG"},1,1,1,0,9.52,{"$f":"Tabla13[[#This Row],[ud2]]","v":"KG"}]
["QUESO PURO DE CABRA S.VICENTE ",0.22,"KG",4.1500000000000004,{"$f":"Tabla13[[#This Row],[Ud]]","v":"KG"},1,1,1,0,18.863636363636367,{"$f":"Tabla13[[#This Row],[ud2]]","v":"KG"}]
["QUESO PURO DE CASTILLA",0.18,"KG",3.59,{"$f":"Tabla13[[#This Row],[Ud]]","v":"KG"},1,1,1,0,19.944444444444443,{"$f":"Tabla13[[#This Row],[ud2]]","v":"KG"}]
["RABO DE TERNERA",1,"KG",7.11,{"$f":"Tabla13[[#This Row],[Ud]]","v":"KG"},1,1,1,0,7.11,{"$f":"Tabla13[[#This Row],[ud2]]","v":"KG"}]
["RAGOUT DE JABALI( CONGELADO)",1,"KG",7.39,{"$f":"Tabla13[[#This Row],[Ud]]","v":"KG"},1,1,1,0,7.39,{"$f":"Tabla13[[#This Row],[ud2]]","v":"KG"}]
["RAIA FRESCA ENTEIRA",1,"KG",9.0950000000000006,{"$f":"Tabla13[[#This Row],[Ud]]","v":"KG"},1,1,1,0,9.0950000000000006,{"$f":"Tabla13[[#This Row],[ud2]]","v":"KG"}]
["RAIZ DE APIO-APIO NABO",0.17,"KG",6.48,{"$f":"Tabla13[[#This Row],[Ud]]","v":"KG"},1,1,1,0,38.117647058823529,{"$f":"Tabla13[[#This Row],[ud2]]","v":"KG"}]
["RAPE FRESCO ",3.4,"KG",12.39,{"$f":"Tabla13[[#This Row],[Ud]]","v":"KG"},1,1,1,0,3.6441176470588239,{"$f":"Tabla13[[#This Row],[ud2]]","v":"KG"}]
["RAPE, COLAS 300/400",1.5,"KG",4.12,{"$f":"Tabla13[[#This Row],[Ud]]","v":"KG"},1,1,1,0,2.7466666666666666,{"$f":"Tabla13[[#This Row],[ud2]]","v":"KG"}]
["REDONDO DE VITELA",1,"KG",8.0299999999999994,{"$f":"Tabla13[[#This Row],[Ud]]","v":"KG"},1,1,1,0,8.0299999999999994,{"$f":"Tabla13[[#This Row],[ud2]]","v":"KG"}]
["REDUCCIÓN VINAGRE MÓDENA FEDERZONI ",0.39700000000000002,"KG",4.29,{"$f":"Tabla13[[#This Row],[Ud]]","v":"KG"},1,1,1,0,10.806045340050378,{"$f":"Tabla13[[#This Row],[ud2]]","v":"KG"}]
["REMOLACHA COCIDA E PELADA EN BOLSA ",0.25,"KG",0.624,{"$f":"Tabla13[[#This Row],[Ud]]","v":"KG"},1,1,1,{"$f":"1-H327","v":0},2.496,{"$f":"Tabla13[[#This Row],[ud2]]","v":"KG"}]
["REPOLLO DO PAIS",1,"KG",1.25,{"$f":"Tabla13[[#This Row],[Ud]]","v":"KG"},1,1,1,0,1.25,{"$f":"Tabla13[[#This Row],[ud2]]","v":"KG"}]
["REPOLLO, RIZO",1,"KG",0.78,{"$f":"Tabla13[[#This Row],[Ud]]","v":"KG"},1,1,1,0,0.78,{"$f":"Tabla13[[#This Row],[ud2]]","v":"KG"}]
["REQUESON LORAN",0.25,"KG",{"$f":"(0.8+0.88)/2","v":0.84000000000000008},{"$f":"Tabla13[[#This Row],[Ud]]","v":"KG"},1,1,{"$f":"G330/F330","v":1},0,3.3600000000000003,{"$f":"Tabla13[[#This Row],[ud2]]","v":"KG"}]
["ROBALIZA DE ACIUCULTURA ",1,"KG",14.58,{"$f":"Tabla13[[#This Row],[Ud]]","v":"KG"},1,0.6,0.6,0.4,14.58,{"$f":"Tabla13[[#This Row],[ud2]]","v":"KG"}]
["ROBALIZA RACIÓN 300-400 GRS",1,"KG",8.64,{"$f":"Tabla13[[#This Row],[Ud]]","v":"KG"},1,0.6,0.6,0.4,8.64,{"$f":"Tabla13[[#This Row],[ud2]]","v":"KG"}]
["RODABALLO FRESCO",1,"KG",18.7,{"$f":"Tabla13[[#This Row],[Ud]]","v":"KG"},1,0.65,0.65,0.35,18.7,{"$f":"Tabla13[[#This Row],[ud2]]","v":"KG"}]
["ROMERO EN BOTE ",0.03,"KG",4.5999999999999996,{"$f":"Tabla13[[#This Row],[Ud]]","v":"KG"},1,1,1,0,153.33333333333331,{"$f":"Tabla13[[#This Row],[ud2]]","v":"KG"}]
["RON BLANCO",1,"L",22,{"$f":"Tabla13[[#This Row],[Ud]]","v":"L"},1,1,1,0,22,{"$f":"Tabla13[[#This Row],[ud2]]","v":"L"}]
["RÚCULA ",1,"KG",2.2000000000000002,{"$f":"Tabla13[[#This Row],[Ud]]","v":"KG"},1,0.9,0.9,9.9999999999999978E-2,2.2000000000000002,{"$f":"Tabla13[[#This Row],[ud2]]","v":"KG"}]
["SAKE- KUROMATSU-HAKUSHKA",0.22,"L",3.35,{"$f":"Tabla13[[#This Row],[Ud]]","v":"L"},1,1,1,0,15.227272727272728,{"$f":"Tabla13[[#This Row],[ud2]]","v":"L"}]
["SAL FINA ",1,"KG",0.24,{"$f":"Tabla13[[#This Row],[Ud]]","v":"KG"},1,1,1,0,0.24,{"$f":"Tabla13[[#This Row],[ud2]]","v":"KG"}]
["SAL GRUESA ",1,"KG",0.25,{"$f":"Tabla13[[#This Row],[Ud]]","v":"KG"},1,1,1,0,0.25,{"$f":"Tabla13[[#This Row],[ud2]]","v":"KG"}]
["SAL GRUESA HORNEAR ",2,"KG",1.26,{"$f":"Tabla13[[#This Row],[Ud]]","v":"KG"},1,1,1,0,0.63,{"$f":"Tabla13[[#This Row],[ud2]]","v":"KG"}]
["SAL MALDON ",2.5,"KG",4.96,{"$f":"Tabla13[[#This Row],[Ud]]","v":"KG"},1,1,1,0,1.984,{"$f":"Tabla13[[#This Row],[ud2]]","v":"KG"}]
["SAL MALDÓN AHUMADA ",0.25,"KG",5.17,{"$f":"Tabla13[[#This Row],[Ud]]","v":"KG"},1,1,1,0,{"$f":"IF(B342<1,D342/B342,D342/B342)","v":20.68},{"$f":"Tabla13[[#This Row],[ud2]]","v":"KG"}]
["SALCHICHÓN CULAR",1,"KG",7.2,{"$f":"Tabla13[[#This Row],[Ud]]","v":"KG"},1,1,1,0,7.2,{"$f":"Tabla13[[#This Row],[ud2]]","v":"KG"}]
["SALMÓN ",1,"KG",7.5,{"$f":"Tabla13[[#This Row],[Ud]]","v":"KG"},1,1,1,0,7.5,{"$f":"Tabla13[[#This Row],[ud2]]","v":"KG"}]
["SALMÓN AHUMADO",1,"KG",19.5,{"$f":"Tabla13[[#This Row],[Ud]]","v":"KG"},1,1,1,0,19.5,{"$f":"Tabla13[[#This Row],[ud2]]","v":"KG"}]
["SALMONETE",1,"KG",17,{"$f":"Tabla13[[#This Row],[Ud]]","v":"KG"},1,0.8,0.8,0.19999999999999996,17,{"$f":"Tabla13[[#This Row],[ud2]]","v":"KG"}]
["SALSA PEMENTA",1,"KG",4,{"$f":"Tabla13[[#This Row],[Ud]]","v":"KG"},1,1,1,0,4,{"$f":"Tabla13[[#This Row],[ud2]]","v":"KG"}]
["SALSA TABASCO 60 ML",0.6,"L",6.4260000000000002,{"$f":"Tabla13[[#This Row],[Ud]]","v":"L"},1,1,1,0,10.71,{"$f":"Tabla13[[#This Row],[ud2]]","v":"L"}]
["SAN MARTIÑO",1,"KG",13.5,{"$f":"Tabla13[[#This Row],[Ud]]","v":"KG"},1,0.45,0.45,0.55000000000000004,13.5,{"$f":"Tabla13[[#This Row],[ud2]]","v":"KG"}]
["SANDÍA",1,"KG",0.59,{"$f":"Tabla13[[#This Row],[Ud]]","v":"KG"},1,1,1,0,0.59,{"$f":"Tabla13[[#This Row],[ud2]]","v":"KG"}]
["SARDINILLA CORTIZO ",1,"KG",13.80952380952381,{"$f":"Tabla13[[#This Row],[Ud]]","v":"KG"},1,1,1,0,13.80952380952381,{"$f":"Tabla13[[#This Row],[ud2]]","v":"KG"}]
["SARGO",1,"KG",12,{"$f":"Tabla13[[#This Row],[Ud]]","v":"KG"},1,0.75,0.75,0.25,12,{"$f":"Tabla13[[#This Row],[ud2]]","v":"KG"}]
["SECRETO DE CERDO IBÉRICO ",1,"KG",14.472,{"$f":"Tabla13[[#This Row],[Ud]]","v":"KG"},1,1,1,0,14.472,{"$f":"Tabla13[[#This Row],[ud2]]","v":"KG"}]
["SEMOLA DE TRIGO 0,500 GRS",0.5,"KG",0.39,{"$f":"Tabla13[[#This Row],[Ud]]","v":"KG"},1,1,1,0,0.78,{"$f":"Tabla13[[#This Row],[ud2]]","v":"KG"}]
["SEPIA CONXELADA",1,"KG",5.08,{"$f":"Tabla13[[#This Row],[Ud]]","v":"KG"},1,1,1,0,5.08,{"$f":"Tabla13[[#This Row],[ud2]]","v":"KG"}]
["SÉSAMO NATURAL VELLO MUIÑO ",1,"KG",2.66,{"$f":"Tabla13[[#This Row],[Ud]]","v":"KG"},1,1,1,0,2.66,{"$f":"Tabla13[[#This Row],[ud2]]","v":"KG"}]
["SETA BOLETUS EDULIS GR. CONX.",1,"KG",13.5,{"$f":"Tabla13[[#This Row],[Ud]]","v":"KG"},1,1,1,0,13.5,{"$f":"Tabla13[[#This Row],[ud2]]","v":"KG"}]
["SETA FANTASÍA CONGELADA",1,"Kg",7.1,{"$f":"Tabla13[[#This Row],[Ud]]","v":"Kg"},1,1,{"$f":"Tabla13[[#This Row],[Neto]]/Tabla13[[#This Row],[Bruto]]","v":1},0,{"$f":"(1*D358)/B358","v":7.1},{"$f":"Tabla13[[#This Row],[ud2]]","v":"Kg"}]
["SETA PORTOBELLO",1,"KG",4.8879999999999999,{"$f":"Tabla13[[#This Row],[Ud]]","v":"KG"},1,1,{"$f":"G359/F359","v":1},0,{"$f":"IF(B359<1,D359/B359,D359/B359)","v":4.8879999999999999},{"$f":"Tabla13[[#This Row],[ud2]]","v":"KG"}]
["SETA SHIITAKE BANDEXA ",0.25,"KG",2.98,{"$f":"Tabla13[[#This Row],[Ud]]","v":"KG"},1,1,1,0,11.92,{"$f":"Tabla13[[#This Row],[ud2]]","v":"KG"}]
["SETAS",0.2,"KG",2.8250000000000002,{"$f":"Tabla13[[#This Row],[Ud]]","v":"KG"},1,1,1,0,14.125,{"$f":"Tabla13[[#This Row],[ud2]]","v":"KG"}]
["SHITAKE",1,"KG",9,{"$f":"Tabla13[[#This Row],[Ud]]","v":"KG"},1,1,1,0,9,{"$f":"Tabla13[[#This Row],[ud2]]","v":"KG"}]
["SHUSHI-NORI 28 GRS, 10 PLACAS",0.28000000000000003,"KG",3.5,{"$f":"Tabla13[[#This Row],[Ud]]","v":"KG"},1,1,1,0,12.499999999999998,{"$f":"Tabla13[[#This Row],[ud2]]","v":"KG"}]
["SIDRA MANZANOVA ECOLÓXICA",1,"L",1.4,{"$f":"Tabla13[[#This Row],[Ud]]","v":"L"},1,1,1,0,1.4,{"$f":"Tabla13[[#This Row],[ud2]]","v":"L"}]
["SOÁ DE PORCO SALADA",1,"KG",3.3,{"$f":"Tabla13[[#This Row],[Ud]]","v":"KG"},1,1,1,0,3.3,{"$f":"Tabla13[[#This Row],[ud2]]","v":"KG"}]
["SOLOMILLO CERDO IBÉRICO BELLOTA",1,"KG",17.5,{"$f":"Tabla13[[#This Row],[Ud]]","v":"KG"},1,1,1,0,17.5,{"$f":"Tabla13[[#This Row],[ud2]]","v":"KG"}]
["SOLOMILLO DE AVESTRUZ",1,"KG",32.9,{"$f":"Tabla13[[#This Row],[Ud]]","v":"KG"},1,1,1,0,32.9,{"$f":"Tabla13[[#This Row],[ud2]]","v":"KG"}]
["SOLOMILLO DE BUEY",1,"KG",27.5,{"$f":"Tabla13[[#This Row],[Ud]]","v":"KG"},1,1,1,0,27.5,{"$f":"Tabla13[[#This Row],[ud2]]","v":"KG"}]
["SOLOMILLO DE CERDO",1,"KG",9.0399999999999991,{"$f":"Tabla13[[#This Row],[Ud]]","v":"KG"},1,1,1,0,9.0399999999999991,{"$f":"Tabla13[[#This Row],[ud2]]","v":"KG"}]
["SOLOMILLO DE CERDO",1,"KG",5.42,{"$f":"Tabla13[[#This Row],[Ud]]","v":"KG"},1,1,1,0,5.42,{"$f":"Tabla13[[#This Row],[ud2]]","v":"KG"}]
["SOLOMILLO DE CERDO IBÉRICO",1,"KG",14.25,{"$f":"Tabla13[[#This Row],[Ud]]","v":"KG"},1,1,1,0,14.25,{"$f":"Tabla13[[#This Row],[ud2]]","v":"KG"}]
["SOLOMILLO DE TERNERA",1,"KG",18.2,{"$f":"Tabla13[[#This Row],[Ud]]","v":"KG"},1,1,1,0,18.2,{"$f":"Tabla13[[#This Row],[ud2]]","v":"KG"}]
["SOLOMILLO PATO",1,"KG",10.8,{"$f":"Tabla13[[#This Row],[Ud]]","v":"KG"},1,1,1,0,10.8,{"$f":"Tabla13[[#This Row],[ud2]]","v":"KG"}]
["SPAGGHETTI ",0.25,"KG",1.74,{"$f":"Tabla13[[#This Row],[Ud]]","v":"KG"},1,1,1,0,6.96,{"$f":"Tabla13[[#This Row],[ud2]]","v":"KG"}]
["SUPERLOMOS DE BACALAO",0.5,"KG",10.35,{"$f":"Tabla13[[#This Row],[Ud]]","v":"KG"},1,1,1,0,20.7,{"$f":"Tabla13[[#This Row],[ud2]]","v":"KG"}]
["SUSHI NORI-ALGA NORI PARA SUSHI YAKI",0.03,"por lámina",2.6339999999999999,{"$f":"Tabla13[[#This Row],[Ud]]","v":"por lámina"},1,1,1,0,87.8,{"$f":"Tabla13[[#This Row],[ud2]]","v":"por lámina"}]
["TOCINO DE LOMBO ",1,"KG",3.5310000000000001,{"$f":"Tabla13[[#This Row],[Ud]]","v":"KG"},1,1,1,0,3.5310000000000001,{"$f":"Tabla13[[#This Row],[ud2]]","v":"KG"}]
["TOMATE CHERRY",1,"KG",2.9,{"$f":"Tabla13[[#This Row],[Ud]]","v":"KG"},1,1,1,0,2.9,{"$f":"Tabla13[[#This Row],[ud2]]","v":"KG"}]
["TOMATE ENSALADA",1,"KG",1.3,{"$f":"Tabla13[[#This Row],[Ud]]","v":"KG"},1,1,1,0,1.3,{"$f":"Tabla13[[#This Row],[ud2]]","v":"KG"}]
["TOMATE FRITO ",1,"KG",1.1439999999999999,{"$f":"Tabla13[[#This Row],[Ud]]","v":"KG"},1,1,1,0,1.1439999999999999,{"$f":"Tabla13[[#This Row],[ud2]]","v":"KG"}]
["TOMATE RAMA",1,"KG",1.65,{"$f":"Tabla13[[#This Row],[Ud]]","v":"KG"},1,1,1,0,1.65,{"$f":"Tabla13[[#This Row],[ud2]]","v":"KG"}]
["TOMILLO EN BOTE ",0.04,"KG",2.69,{"$f":"Tabla13[[#This Row],[Ud]]","v":"KG"},1,1,1,0,67.25,{"$f":"Tabla13[[#This Row],[ud2]]","v":"KG"}]
["TRUCHAS PEQUEÑAS",1,"KG",9,{"$f":"Tabla13[[#This Row],[Ud]]","v":"KG"},1,0.85,0.85,0.15000000000000002,9,{"$f":"Tabla13[[#This Row],[ud2]]","v":"KG"}]
["UNTO DE CERDO",1,"KG",4.46,{"$f":"Tabla13[[#This Row],[Ud]]","v":"KG"},1,1,1,0,4.46,{"$f":"Tabla13[[#This Row],[ud2]]","v":"KG"}]
["UVA BLANCA",1,"KG",2.4,{"$f":"Tabla13[[#This Row],[Ud]]","v":"KG"},1,1,1,0,2.4,{"$f":"Tabla13[[#This Row],[ud2]]","v":"KG"}]
["UVA NEGRA",1,"KG",3.32,{"$f":"Tabla13[[#This Row],[Ud]]","v":"KG"},1,1,1,0,3.32,{"$f":"Tabla13[[#This Row],[ud2]]","v":"KG"}]
["UVAS PASAS SEN PEPITAS, BOLSA ",1,"KG",2.4900000000000002,{"$f":"Tabla13[[#This Row],[Ud]]","v":"KG"},1,1,1,0,2.4900000000000002,{"$f":"Tabla13[[#This Row],[ud2]]","v":"KG"}]
["VAINA CALAMAR",1,"KG",5,{"$f":"Tabla13[[#This Row],[Ud]]","v":"KG"},1,1,1,0,5,{"$f":"Tabla13[[#This Row],[ud2]]","v":"KG"}]
["VAINILLA",2.5000000000000001E-2,"KG",3.9,{"$f":"Tabla13[[#This Row],[Ud]]","v":"KG"},1,1,1,0,156,{"$f":"Tabla13[[#This Row],[ud2]]","v":"KG"}]
["VIEIRA  EVISC.  ",1,"KG",4.3,{"$f":"Tabla13[[#This Row],[Ud]]","v":"KG"},1,1,1,0,4.3,{"$f":"Tabla13[[#This Row],[ud2]]","v":"KG"}]
["VIEIRA 3/5",1,"KG",4.3,{"$f":"Tabla13[[#This Row],[Ud]]","v":"KG"},1,1,1,{"$f":"1-H391","v":0},4.3,{"$f":"Tabla13[[#This Row],[ud2]]","v":"KG"}]
["VIEIRA 5/7",1,"KG",4.51,{"$f":"Tabla13[[#This Row],[Ud]]","v":"KG"},1,1,1,0,4.51,{"$f":"Tabla13[[#This Row],[ud2]]","v":"KG"}]
["VINAGRE BALSÁMICO DE MÓDENA",1,"L",2.4300000000000002,{"$f":"Tabla13[[#This Row],[Ud]]","v":"L"},1,1,1,0,2.4300000000000002,{"$f":"Tabla13[[#This Row],[ud2]]","v":"L"}]
["VINAGRE BLANCO",1,"L",1,{"$f":"Tabla13[[#This Row],[Ud]]","v":"L"},1,1,1,0,1,{"$f":"Tabla13[[#This Row],[ud2]]","v":"L"}]
["VINAGRE DE ARROZ MARRÓN CHINO",0.3,"L",0.72,{"$f":"Tabla13[[#This Row],[Ud]]","v":"L"},1,1,1,0,2.4,{"$f":"Tabla13[[#This Row],[ud2]]","v":"L"}]
["VINAGRE DE FRAMBUESA LOUIT",1,"L",7,{"$f":"Tabla13[[#This Row],[Ud]]","v":"L"},1,1,1,0,7,{"$f":"Tabla13[[#This Row],[ud2]]","v":"L"}]
["VINAGRE DE JEREZ",1,"L",4.4400000000000004,{"$f":"Tabla13[[#This Row],[Ud]]","v":"L"},1,1,1,0,4.4400000000000004,{"$f":"Tabla13[[#This Row],[ud2]]","v":"L"}]
["VINAGRE LOUIT ESTRAGÓN ",1,"L",3.6106666666666665,{"$f":"Tabla13[[#This Row],[Ud]]","v":"L"},1,1,1,0,3.6106666666666665,{"$f":"Tabla13[[#This Row],[ud2]]","v":"L"}]
["VINAGRE LOUIT MAZÁ",1,"L",2.6533333333333333,{"$f":"Tabla13[[#This Row],[Ud]]","v":"L"},1,1,1,0,2.6533333333333333,{"$f":"Tabla13[[#This Row],[ud2]]","v":"L"}]
["VINO BLANCO",0.75,"L",2.6533333333333333,{"$f":"Tabla13[[#This Row],[Ud]]","v":"L"},1,1,1,0,3.5377777777777779,{"$f":"Tabla13[[#This Row],[ud2]]","v":"L"}]
["VINO OPORTO OFFLEY",0.75,"L",6,{"$f":"Tabla13[[#This Row],[Ud]]","v":"L"},1,1,1,0,8,{"$f":"Tabla13[[#This Row],[ud2]]","v":"L"}]
["VINO TOSTADO MOSCATEL",1,"L",4.1333333333333337,{"$f":"Tabla13[[#This Row],[Ud]]","v":"L"},1,1,1,0,4.1333333333333337,{"$f":"Tabla13[[#This Row],[ud2]]","v":"L"}]
["VIÑO TINTO",1,"L",1,{"$f":"Tabla13[[#This Row],[Ud]]","v":"L"},1,1,1,0,1,{"$f":"Tabla13[[#This Row],[ud2]]","v":"L"}]
["YEMAS DE ESPÁRRAGO",1,"KG",8,{"$f":"Tabla13[[#This Row],[Ud]]","v":"KG"},1,1,1,0,8,{"$f":"Tabla13[[#This Row],[ud2]]","v":"KG"}]
["ZAMBURIÑA CARNE",1,"KG",6.7,{"$f":"Tabla13[[#This Row],[Ud]]","v":"KG"},1,1,1,0,6.7,{"$f":"Tabla13[[#This Row],[ud2]]","v":"KG"}]
["ZANAHORIA",1,"Kg",0.6,{"$f":"Tabla13[[#This Row],[Ud]]","v":"Kg"},1,0.9,{"$f":"Tabla13[[#This Row],[Neto]]/Tabla13[[#This Row],[Bruto]]","v":0.9},9.9999999999999978E-2,{"$f":"(1*D406)/B406","v":0.6},{"$f":"Tabla13[[#This Row],[ud2]]","v":"Kg"}]
[null,null,null,null,{"$f":"Tabla13[[#This Row],[Ud]]","v":0}]
[null,null,null,null,{"$f":"Tabla13[[#This Row],[Ud]]","v":0}]
[]
[]
[]
[]
[]
[]
[]
[]
[]
[]
[]
[]
[]
[]
[]
[]
[]
[]
[]
[]
[]
[]
[]
[]
[]
[]
[null,null,null,null,null,null,null,null,null,null,{"$f":"Tabla13[[#This Row],[ud2]]","v":0}]
[null,null,null,null,null,null,null,null,null,null,{"$f":"Tabla13[[#This Row],[ud2]]","v":0}]
[null,null,null,null,null,null,null,null,null,null,{"$f":"Tabla13[[#This Row],[ud2]]","v":0}]
[null,null,null,null,null,null,null,null,null,null,{"$f":"Tabla13[[#This Row],[ud2]]","v":0}]
[null,null,null,null,null,null,null,null,null,null,{"$f":"Tabla13[[#This Row],[ud2]]","v":0}]
[null,null,null,null,null,null,null,null,null,null,{"$f":"Tabla13[[#This Row],[ud2]]","v":0}]
[null,null,null,null,null,null,null,null,null,null,{"$f":"Tabla13[[#This Row],[ud2]]","v":0}]
[null,null,null,null,null,null,null,null,null,null,{"$f":"Tabla13[[#This Row],[ud2]]","v":0}]
[null,null,null,null,null,null,null,null,null,null,{"$f":"Tabla13[[#This Row],[ud2]]","v":0}]
[null,null,null,null,null,null,null,null,null,null,{"$f":"Tabla13[[#This Row],[ud2]]","v":0}]
[null,null,null,null,null,null,null,null,null,null,{"$f":"Tabla13[[#This Row],[ud2]]","v":0}]
[null,null,null,null,null,null,null,null,null,null,{"$f":"Tabla13[[#This Row],[ud2]]","v":0}]
[null,null,null,null,null,null,null,null,null,null,{"$f":"Tabla13[[#This Row],[ud2]]","v":0}]
[null,null,null,null,null,null,null,null,null,null,{"$f":"Tabla13[[#This Row],[ud2]]","v":0}]
[null,null,null,null,null,null,null,null,null,null,{"$f":"Tabla13[[#This Row],[ud2]]","v":0}]
[null,null,null,null,null,null,null,null,null,null,{"$f":"Tabla13[[#This Row],[ud2]]","v":0}]
[null,null,null,null,null,null,null,null,null,null,{"$f":"Tabla13[[#This Row],[ud2]]","v":0}]
[null,null,null,null,null,null,null,null,null,null,{"$f":"Tabla13[[#This Row],[ud2]]","v":0}]
[null,null,null,null,null,null,null,null,null,null,{"$f":"Tabla13[[#This Row],[ud2]]","v":0}]
[null,null,null,null,null,null,null,null,null,null,{"$f":"Tabla13[[#This Row],[ud2]]","v":0}]
[null,null,null,null,null,null,null,null,null,null,{"$f":"Tabla13[[#This Row],[ud2]]","v":0}]
[null,null,null,null,null,null,null,null,null,null,{"$f":"Tabla13[[#This Row],[ud2]]","v":0}]
[null,null,null,null,null,null,null,null,null,null,{"$f":"Tabla13[[#This Row],[ud2]]","v":0}]
[null,null,null,null,null,null,null,null,null,null,{"$f":"Tabla13[[#This Row],[ud2]]","v":0}]
[null,null,null,null,null,null,null,null,null,null,{"$f":"Tabla13[[#This Row],[ud2]]","v":0}]
[null,null,null,null,null,null,null,null,null,null,{"$f":"Tabla13[[#This Row],[ud2]]","v":0}]
[null,null,null,null,null,null,null,null,null,null,{"$f":"Tabla13[[#This Row],[ud2]]","v":0}]
[null,null,null,null,null,null,null,null,null,null,{"$f":"Tabla13[[#This Row],[ud2]]","v":0}]
[null,null,null,null,null,null,null,null,null,null,{"$f":"Tabla13[[#This Row],[ud2]]","v":0}]
[null,null,null,null,null,null,null,null,null,null,{"$f":"Tabla13[[#This Row],[ud2]]","v":0}]
[null,null,null,null,null,null,null,null,null,null,{"$f":"Tabla13[[#This Row],[ud2]]","v":0}]
[null,null,null,null,null,null,null,null,null,null,{"$f":"Tabla13[[#This Row],[ud2]]","v":0}]
[null,null,null,null,null,null,null,null,null,null,{"$f":"Tabla13[[#This Row],[ud2]]","v":0}]
[null,null,null,null,null,null,null,null,null,null,{"$f":"Tabla13[[#This Row],[ud2]]","v":0}]
[null,null,null,null,null,null,null,null,null,null,{"$f":"Tabla13[[#This Row],[ud2]]","v":0}]
[null,null,null,null,null,null,null,null,null,null,{"$f":"Tabla13[[#This Row],[ud2]]","v":0}]
[null,null,null,null,null,null,null,null,null,null,{"$f":"Tabla13[[#This Row],[ud2]]","v":0}]
[null,null,null,null,null,null,null,null,null,null,{"$f":"Tabla13[[#This Row],[ud2]]","v":0}]
[null,null,null,null,null,null,null,null,null,null,{"$f":"Tabla13[[#This Row],[ud2]]","v":0}]
[null,null,null,null,null,null,null,null,null,null,{"$f":"Tabla13[[#This Row],[ud2]]","v":0}]
[null,null,null,null,null,null,null,null,null,null,{"$f":"Tabla13[[#This Row],[ud2]]","v":0}]
[null,null,null,null,null,null,null,null,null,null,{"$f":"Tabla13[[#This Row],[ud2]]","v":0}]
[null,null,null,null,null,null,null,null,null,null,{"$f":"Tabla13[[#This Row],[ud2]]","v":0}]
[null,null,null,null,null,null,null,null,null,null,{"$f":"Tabla13[[#This Row],[ud2]]","v":0}]
[null,null,null,null,null,null,null,null,null,null,{"$f":"Tabla13[[#This Row],[ud2]]","v":0}]
[null,null,null,null,null,null,null,null,null,null,{"$f":"Tabla13[[#This Row],[ud2]]","v":0}]
[null,null,null,null,null,null,null,null,null,null,{"$f":"Tabla13[[#This Row],[ud2]]","v":0}]
[null,null,null,null,null,null,null,null,null,null,{"$f":"Tabla13[[#This Row],[ud2]]","v":0}]
[null,null,null,null,null,null,null,null,null,null,{"$f":"Tabla13[[#This Row],[ud2]]","v":0}]
[null,null,null,null,null,null,null,null,null,null,{"$f":"Tabla13[[#This Row],[ud2]]","v":0}]
[null,null,null,null,null,null,null,null,null,null,{"$f":"Tabla13[[#This Row],[ud2]]","v":0}]
[null,null,null,null,null,null,null,null,null,null,{"$f":"Tabla13[[#This Row],[ud2]]","v":0}]
[null,null,null,null,null,null,null,null,null,null,{"$f":"Tabla13[[#This Row],[ud2]]","v":0}]
[null,null,null,null,null,null,null,null,null,null,{"$f":"Tabla13[[#This Row],[ud2]]","v":0}]
[null,null,null,null,null,null,null,null,null,null,{"$f":"Tabla13[[#This Row],[ud2]]","v":0}]
[null,null,null,null,null,null,null,null,null,null,{"$f":"Tabla13[[#This Row],[ud2]]","v":0}]
[null,null,null,null,null,null,null,null,null,null,{"$f":"Tabla13[[#This Row],[ud2]]","v":0}]
[null,null,null,null,null,null,null,null,null,null,{"$f":"Tabla13[[#This Row],[ud2]]","v":0}]
[null,null,null,null,null,null,null,null,null,null,{"$f":"Tabla13[[#This Row],[ud2]]","v":0}]
[null,null,null,null,null,null,null,null,null,null,{"$f":"Tabla13[[#This Row],[ud2]]","v":0}]
[null,null,null,null,null,null,null,null,null,null,{"$f":"Tabla13[[#This Row],[ud2]]","v":0}]
[null,null,null,null,null,null,null,null,null,null,{"$f":"Tabla13[[#This Row],[ud2]]","v":0}]
[null,null,null,null,null,null,null,null,null,null,{"$f":"Tabla13[[#This Row],[ud2]]","v":0}]
[null,null,null,null,null,null,null,null,null,null,{"$f":"Tabla13[[#This Row],[ud2]]","v":0}]
[null,null,null,null,null,null,null,null,null,null,{"$f":"Tabla13[[#This Row],[ud2]]","v":0}]
[null,null,null,null,null,null,null,null,null,null,{"$f":"Tabla13[[#This Row],[ud2]]","v":0}]
[null,null,null,null,null,null,null,null,null,null,{"$f":"Tabla13[[#This Row],[ud2]]","v":0}]
[null,null,null,null,null,null,null,null,null,null,{"$f":"Tabla13[[#This Row],[ud2]]","v":0}]
[null,null,null,null,null,null,null,null,null,null,{"$f":"Tabla13[[#This Row],[ud2]]","v":0}]
[null,null,null,null,null,null,null,null,null,null,{"$f":"Tabla13[[#This Row],[ud2]]","v":0}]
[null,null,null,null,null,null,null,null,null,null,{"$f":"Tabla13[[#This Row],[ud2]]","v":0}]
[null,null,null,null,null,null,null,null,null,null,{"$f":"Tabla13[[#This Row],[ud2]]","v":0}]
[null,null,null,null,null,null,null,null,null,null,{"$f":"Tabla13[[#This Row],[ud2]]","v":0}]
[null,null,null,null,null,null,null,null,null,null,{"$f":"Tabla13[[#This Row],[ud2]]","v":0}]
[null,null,null,null,null,null,null,null,null,null,{"$f":"Tabla13[[#This Row],[ud2]]","v":0}]
[null,null,null,null,null,null,null,null,null,null,{"$f":"Tabla13[[#This Row],[ud2]]","v":0}]
[null,null,null,null,null,null,null,null,null,null,{"$f":"Tabla13[[#This Row],[ud2]]","v":0}]
[null,null,null,null,null,null,null,null,null,null,{"$f":"Tabla13[[#This Row],[ud2]]","v":0}]
[null,null,null,null,null,null,null,null,null,null,{"$f":"Tabla13[[#This Row],[ud2]]","v":0}]
[null,null,null,null,null,null,null,null,null,null,{"$f":"Tabla13[[#This Row],[ud2]]","v":0}]
[null,null,null,null,null,null,null,null,null,null,{"$f":"Tabla13[[#This Row],[ud2]]","v":0}]
[null,null,null,null,null,null,null,null,null,null,{"$f":"Tabla13[[#This Row],[ud2]]","v":0}]
[null,null,null,null,null,null,null,null,null,null,{"$f":"Tabla13[[#This Row],[ud2]]","v":0}]
[null,null,null,null,null,null,null,null,null,null,{"$f":"Tabla13[[#This Row],[ud2]]","v":0}]
[null,null,null,null,null,null,null,null,null,null,{"$f":"Tabla13[[#This Row],[ud2]]","v":0}]
[null,null,null,null,null,null,null,null,null,null,{"$f":"Tabla13[[#This Row],[ud2]]","v":0}]
[null,null,null,null,null,null,null,null,null,null,{"$f":"Tabla13[[#This Row],[ud2]]","v":0}]
[null,null,null,null,null,null,null,null,null,null,{"$f":"Tabla13[[#This Row],[ud2]]","v":0}]
[null,null,null,null,null,null,null,null,null,null,{"$f":"Tabla13[[#This Row],[ud2]]","v":0}]
[null,null,null,null,null,null,null,null,null,null,{"$f":"Tabla13[[#This Row],[ud2]]","v":0}]
[null,null,null,null,null,null,null,null,null,null,{"$f":"Tabla13[[#This Row],[ud2]]","v":0}]
[null,null,null,null,null,null,null,null,null,null,{"$f":"Tabla13[[#This Row],[ud2]]","v":0}]
[null,null,null,null,null,null,null,null,null,null,{"$f":"Tabla13[[#This Row],[ud2]]","v":0}]
[null,null,null,null,null,null,null,null,null,null,{"$f":"Tabla13[[#This Row],[ud2]]","v":0}]
[null,null,null,null,null,null,null,null,null,null,{"$f":"Tabla13[[#This Row],[ud2]]","v":0}]
[null,null,null,null,null,null,null,null,null,null,{"$f":"Tabla13[[#This Row],[ud2]]","v":0}]
[null,null,null,null,null,null,null,null,null,null,{"$f":"Tabla13[[#This Row],[ud2]]","v":0}]
[null,null,null,null,null,null,null,null,null,null,{"$f":"Tabla13[[#This Row],[ud2]]","v":0}]
[null,null,null,null,null,null,null,null,null,null,{"$f":"Tabla13[[#This Row],[ud2]]","v":0}]
[null,null,null,null,null,null,null,null,null,null,{"$f":"Tabla13[[#This Row],[ud2]]","v":0}]
[null,null,null,null,null,null,null,null,null,null,{"$f":"Tabla13[[#This Row],[ud2]]","v":0}]
[null,null,null,null,null,null,null,null,null,null,{"$f":"Tabla13[[#This Row],[ud2]]","v":0}]
[null,null,null,null,null,null,null,null,null,null,{"$f":"Tabla13[[#This Row],[ud2]]","v":0}]
[null,null,null,null,null,null,null,null,null,null,{"$f":"Tabla13[[#This Row],[ud2]]","v":0}]
[null,null,null,null,null,null,null,null,null,null,{"$f":"Tabla13[[#This Row],[ud2]]","v":0}]
[null,null,null,null,null,null,null,null,null,null,{"$f":"Tabla13[[#This Row],[ud2]]","v":0}]
[null,null,null,null,null,null,null,null,null,null,{"$f":"Tabla13[[#This Row],[ud2]]","v":0}]
[null,null,null,null,null,null,null,null,null,null,{"$f":"Tabla13[[#This Row],[ud2]]","v":0}]
[null,null,null,null,null,null,null,null,null,null,{"$f":"Tabla13[[#This Row],[ud2]]","v":0}]
[null,null,null,null,null,null,null,null,null,null,{"$f":"Tabla13[[#This Row],[ud2]]","v":0}]
[null,null,null,null,null,null,null,null,null,null,{"$f":"Tabla13[[#This Row],[ud2]]","v":0}]
[null,null,null,null,null,null,null,null,null,null,{"$f":"Tabla13[[#This Row],[ud2]]","v":0}]
[null,null,null,null,null,null,null,null,null,null,{"$f":"Tabla13[[#This Row],[ud2]]","v":0}]
[null,null,null,null,null,null,null,null,null,null,{"$f":"Tabla13[[#This Row],[ud2]]","v":0}]
[null,null,null,null,null,null,null,null,null,null,{"$f":"Tabla13[[#This Row],[ud2]]","v":0}]
[null,null,null,null,null,null,null,null,null,null,{"$f":"Tabla13[[#This Row],[ud2]]","v":0}]
[null,null,null,null,null,null,null,null,null,null,{"$f":"Tabla13[[#This Row],[ud2]]","v":0}]
[null,null,null,null,null,null,null,null,null,null,{"$f":"Tabla13[[#This Row],[ud2]]","v":0}]
[null,null,null,null,null,null,null,null,null,null,{"$f":"Tabla13[[#This Row],[ud2]]","v":0}]
[null,null,null,null,null,null,null,null,null,null,{"$f":"Tabla13[[#This Row],[ud2]]","v":0}]
[null,null,null,null,null,null,null,null,null,null,{"$f":"Tabla13[[#This Row],[ud2]]","v":0}]
[null,null,null,null,null,null,null,null,null,null,{"$f":"Tabla13[[#This Row],[ud2]]","v":0}]
[null,null,null,null,null,null,null,null,null,null,{"$f":"Tabla13[[#This Row],[ud2]]","v":0}]
[null,null,null,null,null,null,null,null,null,null,{"$f":"Tabla13[[#This Row],[ud2]]","v":0}]
[null,null,null,null,null,null,null,null,null,null,{"$f":"Tabla13[[#This Row],[ud2]]","v":0}]
[null,null,null,null,null,null,null,null,null,null,{"$f":"Tabla13[[#This Row],[ud2]]","v":0}]
[null,null,null,null,null,null,null,null,null,null,{"$f":"Tabla13[[#This Row],[ud2]]","v":0}]
[null,null,null,null,null,null,null,null,null,null,{"$f":"Tabla13[[#This Row],[ud2]]","v":0}]
[null,null,null,null,null,null,null,null,null,null,{"$f":"Tabla13[[#This Row],[ud2]]","v":0}]
[null,null,null,null,null,null,null,null,null,null,{"$f":"Tabla13[[#This Row],[ud2]]","v":0}]
[null,null,null,null,null,null,null,null,null,null,{"$f":"Tabla13[[#This Row],[ud2]]","v":0}]
[null,null,null,null,null,null,null,null,null,null,{"$f":"Tabla13[[#This Row],[ud2]]","v":0}]
[null,null,null,null,null,null,null,null,null,null,{"$f":"Tabla13[[#This Row],[ud2]]","v":0}]
[null,null,null,null,null,null,null,null,null,null,{"$f":"Tabla13[[#This Row],[ud2]]","v":0}]
[null,null,null,null,null,null,null,null,null,null,{"$f":"Tabla13[[#This Row],[ud2]]","v":0}]
[null,null,null,null,null,null,null,null,null,null,{"$f":"Tabla13[[#This Row],[ud2]]","v":0}]
[null,null,null,null,null,null,null,null,null,null,{"$f":"Tabla13[[#This Row],[ud2]]","v":0}]
[null,null,null,null,null,null,null,null,null,null,{"$f":"Tabla13[[#This Row],[ud2]]","v":0}]
[null,null,null,null,null,null,null,null,null,null,{"$f":"Tabla13[[#This Row],[ud2]]","v":0}]
[null,null,null,null,null,null,null,null,null,null,{"$f":"Tabla13[[#This Row],[ud2]]","v":0}]
[null,null,null,null,null,null,null,null,null,null,{"$f":"Tabla13[[#This Row],[ud2]]","v":0}]
[null,null,null,null,null,null,null,null,null,null,{"$f":"Tabla13[[#This Row],[ud2]]","v":0}]
[null,null,null,null,null,null,null,null,null,null,{"$f":"Tabla13[[#This Row],[ud2]]","v":0}]
[null,null,null,null,null,null,null,null,null,null,{"$f":"Tabla13[[#This Row],[ud2]]","v":0}]
[null,null,null,null,null,null,null,null,null,null,{"$f":"Tabla13[[#This Row],[ud2]]","v":0}]
[null,null,null,null,null,null,null,null,null,null,{"$f":"Tabla13[[#This Row],[ud2]]","v":0}]
[null,null,null,null,null,null,null,null,null,null,{"$f":"Tabla13[[#This Row],[ud2]]","v":0}]
[null,null,null,null,null,null,null,null,null,null,{"$f":"Tabla13[[#This Row],[ud2]]","v":0}]
[null,null,null,null,null,null,null,null,null,null,{"$f":"Tabla13[[#This Row],[ud2]]","v":0}]
[null,null,null,null,null,null,null,null,null,null,{"$f":"Tabla13[[#This Row],[ud2]]","v":0}]
[null,null,null,null,null,null,null,null,null,null,{"$f":"Tabla13[[#This Row],[ud2]]","v":0}]
[null,null,null,null,null,null,null,null,null,null,{"$f":"Tabla13[[#This Row],[ud2]]","v":0}]
[null,null,null,null,null,null,null,null,null,null,{"$f":"Tabla13[[#This Row],[ud2]]","v":0}]
[null,null,null,null,null,null,null,null,null,null,{"$f":"Tabla13[[#This Row],[ud2]]","v":0}]
[null,null,null,null,null,null,null,null,null,null,{"$f":"Tabla13[[#This Row],[ud2]]","v":0}]
[null,null,null,null,null,null,null,null,null,null,{"$f":"Tabla13[[#This Row],[ud2]]","v":0}]
[null,null,null,null,null,null,null,null,null,null,{"$f":"Tabla13[[#This Row],[ud2]]","v":0}]
[null,null,null,null,null,null,null,null,null,null,{"$f":"Tabla13[[#This Row],[ud2]]","v":0}]
[null,null,null,null,null,null,null,null,null,null,{"$f":"Tabla13[[#This Row],[ud2]]","v":0}]
[null,null,null,null,null,null,null,null,null,null,{"$f":"Tabla13[[#This Row],[ud2]]","v":0}]
[null,null,null,null,null,null,null,null,null,null,{"$f":"Tabla13[[#This Row],[ud2]]","v":0}]
[null,null,null,null,null,null,null,null,null,null,{"$f":"Tabla13[[#This Row],[ud2]]","v":0}]
[null,null,null,null,null,null,null,null,null,null,{"$f":"Tabla13[[#This Row],[ud2]]","v":0}]
[null,null,null,null,null,null,null,null,null,null,{"$f":"Tabla13[[#This Row],[ud2]]","v":0}]
[null,null,null,null,null,null,null,null,null,null,{"$f":"Tabla13[[#This Row],[ud2]]","v":0}]
[null,null,null,null,null,null,null,null,null,null,{"$f":"Tabla13[[#This Row],[ud2]]","v":0}]
[null,null,null,null,null,null,null,null,null,null,{"$f":"Tabla13[[#This Row],[ud2]]","v":0}]
[null,null,null,null,null,null,null,null,null,null,{"$f":"Tabla13[[#This Row],[ud2]]","v":0}]
[null,null,null,null,null,null,null,null,null,null,{"$f":"Tabla13[[#This Row],[ud2]]","v":0}]
[null,null,null,null,null,null,null,null,null,null,{"$f":"Tabla13[[#This Row],[ud2]]","v":0}]
[null,null,null,null,null,null,null,null,null,null,{"$f":"Tabla13[[#This Row],[ud2]]","v":0}]
[null,null,null,null,null,null,null,null,null,null,{"$f":"Tabla13[[#This Row],[ud2]]","v":0}]
[null,null,null,null,null,null,null,null,null,null,{"$f":"Tabla13[[#This Row],[ud2]]","v":0}]
[null,null,null,null,null,null,null,null,null,null,{"$f":"Tabla13[[#This Row],[ud2]]","v":0}]
[null,null,null,null,null,null,null,null,null,null,{"$f":"Tabla13[[#This Row],[ud2]]","v":0}]
[null,null,null,null,null,null,null,null,null,null,{"$f":"Tabla13[[#This Row],[ud2]]","v":0}]
[null,null,null,null,null,null,null,null,null,null,{"$f":"Tabla13[[#This Row],[ud2]]","v":0}]
[null,null,null,null,null,null,null,null,null,null,{"$f":"Tabla13[[#This Row],[ud2]]","v":0}]
[null,null,null,null,null,null,null,null,null,null,{"$f":"Tabla13[[#This Row],[ud2]]","v":0}]
[null,null,null,null,null,null,null,null,null,null,{"$f":"Tabla13[[#This Row],[ud2]]","v":0}]
[null,null,null,null,null,null,null,null,null,null,{"$f":"Tabla13[[#This Row],[ud2]]","v":0}]
[null,null,null,null,null,null,null,null,null,null,{"$f":"Tabla13[[#This Row],[ud2]]","v":0}]
[null,null,null,null,null,null,null,null,null,null,{"$f":"Tabla13[[#This Row],[ud2]]","v":0}]
[null,null,null,null,null,null,null,null,null,null,{"$f":"Tabla13[[#This Row],[ud2]]","v":0}]
[null,null,null,null,null,null,null,null,null,null,{"$f":"Tabla13[[#This Row],[ud2]]","v":0}]
[null,null,null,null,null,null,null,null,null,null,{"$f":"Tabla13[[#This Row],[ud2]]","v":0}]
[null,null,null,null,null,null,null,null,null,null,{"$f":"Tabla13[[#This Row],[ud2]]","v":0}]
[null,null,null,null,null,null,null,null,null,null,{"$f":"Tabla13[[#This Row],[ud2]]","v":0}]
[null,null,null,null,null,null,null,null,null,null,{"$f":"Tabla13[[#This Row],[ud2]]","v":0}]
[null,null,null,null,null,null,null,null,null,null,{"$f":"Tabla13[[#This Row],[ud2]]","v":0}]
[null,null,null,null,null,null,null,null,null,null,{"$f":"Tabla13[[#This Row],[ud2]]","v":0}]
[null,null,null,null,null,null,null,null,null,null,{"$f":"Tabla13[[#This Row],[ud2]]","v":0}]
[null,null,null,null,null,null,null,null,null,null,{"$f":"Tabla13[[#This Row],[ud2]]","v":0}]
[null,null,null,null,null,null,null,null,null,null,{"$f":"Tabla13[[#This Row],[ud2]]","v":0}]
[null,null,null,null,null,null,null,null,null,null,{"$f":"Tabla13[[#This Row],[ud2]]","v":0}]
[null,null,null,null,null,null,null,null,null,null,{"$f":"Tabla13[[#This Row],[ud2]]","v":0}]
[null,null,null,null,null,null,null,null,null,null,{"$f":"Tabla13[[#This Row],[ud2]]","v":0}]
[null,null,null,null,null,null,null,null,null,null,{"$f":"Tabla13[[#This Row],[ud2]]","v":0}]
[null,null,null,null,null,null,null,null,null,null,{"$f":"Tabla13[[#This Row],[ud2]]","v":0}]
[null,null,null,null,null,null,null,null,null,null,{"$f":"Tabla13[[#This Row],[ud2]]","v":0}]
[null,null,null,null,null,null,null,null,null,null,{"$f":"Tabla13[[#This Row],[ud2]]","v":0}]
[null,null,null,null,null,null,null,null,null,null,{"$f":"Tabla13[[#This Row],[ud2]]","v":0}]
[null,null,null,null,null,null,null,null,null,null,{"$f":"Tabla13[[#This Row],[ud2]]","v":0}]
[null,null,null,null,null,null,null,null,null,null,{"$f":"Tabla13[[#This Row],[ud2]]","v":0}]
[null,null,null,null,null,null,null,null,null,null,{"$f":"Tabla13[[#This Row],[ud2]]","v":0}]
[null,null,null,null,null,null,null,null,null,null,{"$f":"Tabla13[[#This Row],[ud2]]","v":0}]
[null,null,null,null,null,null,null,null,null,null,{"$f":"Tabla13[[#This Row],[ud2]]","v":0}]
[null,null,null,null,null,null,null,null,null,null,{"$f":"Tabla13[[#This Row],[ud2]]","v":0}]
[null,null,null,null,null,null,null,null,null,null,{"$f":"Tabla13[[#This Row],[ud2]]","v":0}]
[null,null,null,null,null,null,null,null,null,null,{"$f":"Tabla13[[#This Row],[ud2]]","v":0}]
[null,null,null,null,null,null,null,null,null,null,{"$f":"Tabla13[[#This Row],[ud2]]","v":0}]
[null,null,null,null,null,null,null,null,null,null,{"$f":"Tabla13[[#This Row],[ud2]]","v":0}]
[null,null,null,null,null,null,null,null,null,null,{"$f":"Tabla13[[#This Row],[ud2]]","v":0}]
[null,null,null,null,null,null,null,null,null,null,{"$f":"Tabla13[[#This Row],[ud2]]","v":0}]
[null,null,null,null,null,null,null,null,null,null,{"$f":"Tabla13[[#This Row],[ud2]]","v":0}]
[null,null,null,null,null,null,null,null,null,null,{"$f":"Tabla13[[#This Row],[ud2]]","v":0}]
[null,null,null,null,null,null,null,null,null,null,{"$f":"Tabla13[[#This Row],[ud2]]","v":0}]
[null,null,null,null,null,null,null,null,null,null,{"$f":"Tabla13[[#This Row],[ud2]]","v":0}]
[null,null,null,null,null,null,null,null,null,null,{"$f":"Tabla13[[#This Row],[ud2]]","v":0}]
[null,null,null,null,null,null,null,null,null,null,{"$f":"Tabla13[[#This Row],[ud2]]","v":0}]
[null,null,null,null,null,null,null,null,null,null,{"$f":"Tabla13[[#This Row],[ud2]]","v":0}]
[null,null,null,null,null,null,null,null,null,null,{"$f":"Tabla13[[#This Row],[ud2]]","v":0}]
[null,null,null,null,null,null,null,null,null,null,{"$f":"Tabla13[[#This Row],[ud2]]","v":0}]
[null,null,null,null,null,null,null,null,null,null,{"$f":"Tabla13[[#This Row],[ud2]]","v":0}]
[null,null,null,null,null,null,null,null,null,null,{"$f":"Tabla13[[#This Row],[ud2]]","v":0}]
[null,null,null,null,null,null,null,null,null,null,{"$f":"Tabla13[[#This Row],[ud2]]","v":0}]
[null,null,null,null,null,null,null,null,null,null,{"$f":"Tabla13[[#This Row],[ud2]]","v":0}]
[null,null,null,null,null,null,null,null,null,null,{"$f":"Tabla13[[#This Row],[ud2]]","v":0}]
[null,null,null,null,null,null,null,null,null,null,{"$f":"Tabla13[[#This Row],[ud2]]","v":0}]
[null,null,null,null,null,null,null,null,null,null,{"$f":"Tabla13[[#This Row],[ud2]]","v":0}]
[null,null,null,null,null,null,null,null,null,null,{"$f":"Tabla13[[#This Row],[ud2]]","v":0}]
[null,null,null,null,null,null,null,null,null,null,{"$f":"Tabla13[[#This Row],[ud2]]","v":0}]
[null,null,null,null,null,null,null,null,null,null,{"$f":"Tabla13[[#This Row],[ud2]]","v":0}]
[null,null,null,null,null,null,null,null,null,null,{"$f":"Tabla13[[#This Row],[ud2]]","v":0}]
[null,null,null,null,null,null,null,null,null,null,{"$f":"Tabla13[[#This Row],[ud2]]","v":0}]
[null,null,null,null,null,null,null,null,null,null,{"$f":"Tabla13[[#This Row],[ud2]]","v":0}]
[null,null,null,null,null,null,null,null,null,null,{"$f":"Tabla13[[#This Row],[ud2]]","v":0}]
[null,null,null,null,null,null,null,null,null,null,{"$f":"Tabla13[[#This Row],[ud2]]","v":0}]
[null,null,null,null,null,null,null,null,null,null,{"$f":"Tabla13[[#This Row],[ud2]]","v":0}]
[null,null,null,null,null,null,null,null,null,null,{"$f":"Tabla13[[#This Row],[ud2]]","v":0}]
[null,null,null,null,null,null,null,null,null,null,{"$f":"Tabla13[[#This Row],[ud2]]","v":0}]
[null,null,null,null,null,null,null,null,null,null,{"$f":"Tabla13[[#This Row],[ud2]]","v":0}]
[null,null,null,null,null,null,null,null,null,null,{"$f":"Tabla13[[#This Row],[ud2]]","v":0}]
[null,null,null,null,null,null,null,null,null,null,{"$f":"Tabla13[[#This Row],[ud2]]","v":0}]
[null,null,null,null,null,null,null,null,null,null,{"$f":"Tabla13[[#This Row],[ud2]]","v":0}]
[null,null,null,null,null,null,null,null,null,null,{"$f":"Tabla13[[#This Row],[ud2]]","v":0}]
[null,null,null,null,null,null,null,null,null,null,{"$f":"Tabla13[[#This Row],[ud2]]","v":0}]
[null,null,null,null,null,null,null,null,null,null,{"$f":"Tabla13[[#This Row],[ud2]]","v":0}]
[null,null,null,null,null,null,null,null,null,null,{"$f":"Tabla13[[#This Row],[ud2]]","v":0}]
[null,null,null,null,null,null,null,null,null,null,{"$f":"Tabla13[[#This Row],[ud2]]","v":0}]
[null,null,null,null,null,null,null,null,null,null,{"$f":"Tabla13[[#This Row],[ud2]]","v":0}]
[null,null,null,null,null,null,null,null,null,null,{"$f":"Tabla13[[#This Row],[ud2]]","v":0}]
[null,null,null,null,null,null,null,null,null,null,{"$f":"Tabla13[[#This Row],[ud2]]","v":0}]
[null,null,null,null,null,null,null,null,null,null,{"$f":"Tabla13[[#This Row],[ud2]]","v":0}]
[null,null,null,null,null,null,null,null,null,null,{"$f":"Tabla13[[#This Row],[ud2]]","v":0}]
[null,null,null,null,null,null,null,null,null,null,{"$f":"Tabla13[[#This Row],[ud2]]","v":0}]
[null,null,null,null,null,null,null,null,null,null,{"$f":"Tabla13[[#This Row],[ud2]]","v":0}]
[null,null,null,null,null,null,null,null,null,null,{"$f":"Tabla13[[#This Row],[ud2]]","v":0}]
[null,null,null,null,null,null,null,null,null,null,{"$f":"Tabla13[[#This Row],[ud2]]","v":0}]
[null,null,null,null,null,null,null,null,null,null,{"$f":"Tabla13[[#This Row],[ud2]]","v":0}]
[null,null,null,null,null,null,null,null,null,null,{"$f":"Tabla13[[#This Row],[ud2]]","v":0}]
[null,null,null,null,null,null,null,null,null,null,{"$f":"Tabla13[[#This Row],[ud2]]","v":0}]
[null,null,null,null,null,null,null,null,null,null,{"$f":"Tabla13[[#This Row],[ud2]]","v":0}]
[null,null,null,null,null,null,null,null,null,null,{"$f":"Tabla13[[#This Row],[ud2]]","v":0}]
[null,null,null,null,null,null,null,null,null,null,{"$f":"Tabla13[[#This Row],[ud2]]","v":0}]
[null,null,null,null,null,null,null,null,null,null,{"$f":"Tabla13[[#This Row],[ud2]]","v":0}]
[null,null,null,null,null,null,null,null,null,null,{"$f":"Tabla13[[#This Row],[ud2]]","v":0}]
[null,null,null,null,null,null,null,null,null,null,{"$f":"Tabla13[[#This Row],[ud2]]","v":0}]
[null,null,null,null,null,null,null,null,null,null,{"$f":"Tabla13[[#This Row],[ud2]]","v":0}]
[null,null,null,null,null,null,null,null,null,null,{"$f":"Tabla13[[#This Row],[ud2]]","v":0}]
[null,null,null,null,null,null,null,null,null,null,{"$f":"Tabla13[[#This Row],[ud2]]","v":0}]
[null,null,null,null,null,null,null,null,null,null,{"$f":"Tabla13[[#This Row],[ud2]]","v":0}]
[null,null,null,null,null,null,null,null,null,null,{"$f":"Tabla13[[#This Row],[ud2]]","v":0}]
[null,null,null,null,null,null,null,null,null,null,{"$f":"Tabla13[[#This Row],[ud2]]","v":0}]
[null,null,null,null,null,null,null,null,null,null,{"$f":"Tabla13[[#This Row],[ud2]]","v":0}]
[null,null,null,null,null,null,null,null,null,null,{"$f":"Tabla13[[#This Row],[ud2]]","v":0}]
[null,null,null,null,null,null,null,null,null,null,{"$f":"Tabla13[[#This Row],[ud2]]","v":0}]
[null,null,null,null,null,null,null,null,null,null,{"$f":"Tabla13[[#This Row],[ud2]]","v":0}]
[null,null,null,null,null,null,null,null,null,null,{"$f":"Tabla13[[#This Row],[ud2]]","v":0}]
[null,null,null,null,null,null,null,null,null,null,{"$f":"Tabla13[[#This Row],[ud2]]","v":0}]
[null,null,null,null,null,null,null,null,null,null,{"$f":"Tabla13[[#This Row],[ud2]]","v":0}]
[null,null,null,null,null,null,null,null,null,null,{"$f":"Tabla13[[#This Row],[ud2]]","v":0}]
[null,null,null,null,null,null,null,null,null,null,{"$f":"Tabla13[[#This Row],[ud2]]","v":0}]
[null,null,null,null,null,null,null,null,null,null,{"$f":"Tabla13[[#This Row],[ud2]]","v":0}]
[null,null,null,null,null,null,null,null,null,null,{"$f":"Tabla13[[#This Row],[ud2]]","v":0}]
[null,null,null,null,null,null,null,null,null,null,{"$f":"Tabla13[[#This Row],[ud2]]","v":0}]
[null,null,null,null,null,null,null,null,null,null,{"$f":"Tabla13[[#This Row],[ud2]]","v":0}]
[null,null,null,null,null,null,null,null,null,null,{"$f":"Tabla13[[#This Row],[ud2]]","v":0}]
[null,null,null,null,null,null,null,null,null,null,{"$f":"Tabla13[[#This Row],[ud2]]","v":0}]
[null,null,null,null,null,null,null,null,null,null,{"$f":"Tabla13[[#This Row],[ud2]]","v":0}]
[null,null,null,null,null,null,null,null,null,null,{"$f":"Tabla13[[#This Row],[ud2]]","v":0}]
[null,null,null,null,null,null,null,null,null,null,{"$f":"Tabla13[[#This Row],[ud2]]","v":0}]
[null,null,null,null,null,null,null,null,null,null,{"$f":"Tabla13[[#This Row],[ud2]]","v":0}]
[null,null,null,null,null,null,null,null,null,null,{"$f":"Tabla13[[#This Row],[ud2]]","v":0}]
[null,null,null,null,null,null,null,null,null,null,{"$f":"Tabla13[[#This Row],[ud2]]","v":0}]
[null,null,null,null,null,null,null,null,null,null,{"$f":"Tabla13[[#This Row],[ud2]]","v":0}]
[null,null,null,null,null,null,null,null,null,null,{"$f":"Tabla13[[#This Row],[ud2]]","v":0}]
[null,null,null,null,null,null,null,null,null,null,{"$f":"Tabla13[[#This Row],[ud2]]","v":0}]
[null,null,null,null,null,null,null,null,null,null,{"$f":"Tabla13[[#This Row],[ud2]]","v":0}]
[null,null,null,null,null,null,null,null,null,null,{"$f":"Tabla13[[#This Row],[ud2]]","v":0}]
[null,null,null,null,null,null,null,null,null,null,{"$f":"Tabla13[[#This Row],[ud2]]","v":0}]
[null,null,null,null,null,null,null,null,null,null,{"$f":"Tabla13[[#This Row],[ud2]]","v":0}]
[null,null,null,null,null,null,null,null,null,null,{"$f":"Tabla13[[#This Row],[ud2]]","v":0}]
[null,null,null,null,null,null,null,null,null,null,{"$f":"Tabla13[[#This Row],[ud2]]","v":0}]
[null,null,null,null,null,null,null,null,null,null,{"$f":"Tabla13[[#This Row],[ud2]]","v":0}]
[null,null,null,null,null,null,null,null,null,null,{"$f":"Tabla13[[#This Row],[ud2]]","v":0}]
[null,null,null,null,null,null,null,null,null,null,{"$f":"Tabla13[[#This Row],[ud2]]","v":0}]
[null,null,null,null,null,null,null,null,null,null,{"$f":"Tabla13[[#This Row],[ud2]]","v":0}]
[null,null,null,null,null,null,null,null,null,null,{"$f":"Tabla13[[#This Row],[ud2]]","v":0}]
[null,null,null,null,null,null,null,null,null,null,{"$f":"Tabla13[[#This Row],[ud2]]","v":0}]
[null,null,null,null,null,null,null,null,null,null,{"$f":"Tabla13[[#This Row],[ud2]]","v":0}]
[null,null,null,null,null,null,null,null,null,null,{"$f":"Tabla13[[#This Row],[ud2]]","v":0}]
[null,null,null,null,null,null,null,null,null,null,{"$f":"Tabla13[[#This Row],[ud2]]","v":0}]
[null,null,null,null,null,null,null,null,null,null,{"$f":"Tabla13[[#This Row],[ud2]]","v":0}]
[null,null,null,null,null,null,null,null,null,null,{"$f":"Tabla13[[#This Row],[ud2]]","v":0}]
[null,null,null,null,null,null,null,null,null,null,{"$f":"Tabla13[[#This Row],[ud2]]","v":0}]
[null,null,null,null,null,null,null,null,null,null,{"$f":"Tabla13[[#This Row],[ud2]]","v":0}]
[null,null,null,null,null,null,null,null,null,null,{"$f":"Tabla13[[#This Row],[ud2]]","v":0}]
[null,null,null,null,null,null,null,null,null,null,{"$f":"Tabla13[[#This Row],[ud2]]","v":0}]
[null,null,null,null,null,null,null,null,null,null,{"$f":"Tabla13[[#This Row],[ud2]]","v":0}]
[null,null,null,null,null,null,null,null,null,null,{"$f":"Tabla13[[#This Row],[ud2]]","v":0}]
[null,null,null,null,null,null,null,null,null,null,{"$f":"Tabla13[[#This Row],[ud2]]","v":0}]
[null,null,null,null,null,null,null,null,null,null,{"$f":"Tabla13[[#This Row],[ud2]]","v":0}]
[null,null,null,null,null,null,null,null,null,null,{"$f":"Tabla13[[#This Row],[ud2]]","v":0}]
[null,null,null,null,null,null,null,null,null,null,{"$f":"Tabla13[[#This Row],[ud2]]","v":0}]
[null,null,null,null,null,null,null,null,null,null,{"$f":"Tabla13[[#This Row],[ud2]]","v":0}]
[null,null,null,null,null,null,null,null,null,null,{"$f":"Tabla13[[#This Row],[ud2]]","v":0}]
[null,null,null,null,null,null,null,null,null,null,{"$f":"Tabla13[[#This Row],[ud2]]","v":0}]
[null,null,null,null,null,null,null,null,null,null,{"$f":"Tabla13[[#This Row],[ud2]]","v":0}]
[null,null,null,null,null,null,null,null,null,null,{"$f":"Tabla13[[#This Row],[ud2]]","v":0}]
[null,null,null,null,null,null,null,null,null,null,{"$f":"Tabla13[[#This Row],[ud2]]","v":0}]
[null,null,null,null,null,null,null,null,null,null,{"$f":"Tabla13[[#This Row],[ud2]]","v":0}]
[null,null,null,null,null,null,null,null,null,null,{"$f":"Tabla13[[#This Row],[ud2]]","v":0}]
[null,null,null,null,null,null,null,null,null,null,{"$f":"Tabla13[[#This Row],[ud2]]","v":0}]
[null,null,null,null,null,null,null,null,null,null,{"$f":"Tabla13[[#This Row],[ud2]]","v":0}]
[null,null,null,null,null,null,null,null,null,null,{"$f":"Tabla13[[#This Row],[ud2]]","v":0}]
[null,null,null,null,null,null,null,null,null,null,{"$f":"Tabla13[[#This Row],[ud2]]","v":0}]
[null,null,null,null,null,null,null,null,null,null,{"$f":"Tabla13[[#This Row],[ud2]]","v":0}]
[null,null,null,null,null,null,null,null,null,null,{"$f":"Tabla13[[#This Row],[ud2]]","v":0}]
[null,null,null,null,null,null,null,null,null,null,{"$f":"Tabla13[[#This Row],[ud2]]","v":0}]
[null,null,null,null,null,null,null,null,null,null,{"$f":"Tabla13[[#This Row],[ud2]]","v":0}]
[null,null,null,null,null,null,null,null,null,null,{"$f":"Tabla13[[#This Row],[ud2]]","v":0}]
[null,null,null,null,null,null,null,null,null,null,{"$f":"Tabla13[[#This Row],[ud2]]","v":0}]
[null,null,null,null,null,null,null,null,null,null,{"$f":"Tabla13[[#This Row],[ud2]]","v":0}]
[null,null,null,null,null,null,null,null,null,null,{"$f":"Tabla13[[#This Row],[ud2]]","v":0}]
[null,null,null,null,null,null,null,null,null,null,{"$f":"Tabla13[[#This Row],[ud2]]","v":0}]
[null,null,null,null,null,null,null,null,null,null,{"$f":"Tabla13[[#This Row],[ud2]]","v":0}]
[null,null,null,null,null,null,null,null,null,null,{"$f":"Tabla13[[#This Row],[ud2]]","v":0}]
[null,null,null,null,null,null,null,null,null,null,{"$f":"Tabla13[[#This Row],[ud2]]","v":0}]
[null,null,null,null,null,null,null,null,null,null,{"$f":"Tabla13[[#This Row],[ud2]]","v":0}]
[null,null,null,null,null,null,null,null,null,null,{"$f":"Tabla13[[#This Row],[ud2]]","v":0}]
[null,null,null,null,null,null,null,null,null,null,{"$f":"Tabla13[[#This Row],[ud2]]","v":0}]
[null,null,null,null,null,null,null,null,null,null,{"$f":"Tabla13[[#This Row],[ud2]]","v":0}]
[null,null,null,null,null,null,null,null,null,null,{"$f":"Tabla13[[#This Row],[ud2]]","v":0}]
[null,null,null,null,null,null,null,null,null,null,{"$f":"Tabla13[[#This Row],[ud2]]","v":0}]
[null,null,null,null,null,null,null,null,null,null,{"$f":"Tabla13[[#This Row],[ud2]]","v":0}]
[null,null,null,null,null,null,null,null,null,null,{"$f":"Tabla13[[#This Row],[ud2]]","v":0}]
[null,null,null,null,null,null,null,null,null,null,{"$f":"Tabla13[[#This Row],[ud2]]","v":0}]
[null,null,null,null,null,null,null,null,null,null,{"$f":"Tabla13[[#This Row],[ud2]]","v":0}]
[null,null,null,null,null,null,null,null,null,null,{"$f":"Tabla13[[#This Row],[ud2]]","v":0}]
[null,null,null,null,null,null,null,null,null,null,{"$f":"Tabla13[[#This Row],[ud2]]","v":0}]
[null,null,null,null,null,null,null,null,null,null,{"$f":"Tabla13[[#This Row],[ud2]]","v":0}]
[null,null,null,null,null,null,null,null,null,null,{"$f":"Tabla13[[#This Row],[ud2]]","v":0}]
[null,null,null,null,null,null,null,null,null,null,{"$f":"Tabla13[[#This Row],[ud2]]","v":0}]
[null,null,null,null,null,null,null,null,null,null,{"$f":"Tabla13[[#This Row],[ud2]]","v":0}]
[null,null,null,null,null,null,null,null,null,null,{"$f":"Tabla13[[#This Row],[ud2]]","v":0}]
[null,null,null,null,null,null,null,null,null,null,{"$f":"Tabla13[[#This Row],[ud2]]","v":0}]
[null,null,null,null,null,null,null,null,null,null,{"$f":"Tabla13[[#This Row],[ud2]]","v":0}]
[null,null,null,null,null,null,null,null,null,null,{"$f":"Tabla13[[#This Row],[ud2]]","v":0}]
[null,null,null,null,null,null,null,null,null,null,{"$f":"Tabla13[[#This Row],[ud2]]","v":0}]
[null,null,null,null,null,null,null,null,null,null,{"$f":"Tabla13[[#This Row],[ud2]]","v":0}]
[null,null,null,null,null,null,null,null,null,null,{"$f":"Tabla13[[#This Row],[ud2]]","v":0}]
[null,null,null,null,null,null,null,null,null,null,{"$f":"Tabla13[[#This Row],[ud2]]","v":0}]
[null,null,null,null,null,null,null,null,null,null,{"$f":"Tabla13[[#This Row],[ud2]]","v":0}]
[null,null,null,null,null,null,null,null,null,null,{"$f":"Tabla13[[#This Row],[ud2]]","v":0}]
[null,null,null,null,null,null,null,null,null,null,{"$f":"Tabla13[[#This Row],[ud2]]","v":0}]
[null,null,null,null,null,null,null,null,null,null,{"$f":"Tabla13[[#This Row],[ud2]]","v":0}]
[null,null,null,null,null,null,null,null,null,null,{"$f":"Tabla13[[#This Row],[ud2]]","v":0}]
[null,null,null,null,null,null,null,null,null,null,{"$f":"Tabla13[[#This Row],[ud2]]","v":0}]
[null,null,null,null,null,null,null,null,null,null,{"$f":"Tabla13[[#This Row],[ud2]]","v":0}]
[null,null,null,null,null,null,null,null,null,null,{"$f":"Tabla13[[#This Row],[ud2]]","v":0}]
[null,null,null,null,null,null,null,null,null,null,{"$f":"Tabla13[[#This Row],[ud2]]","v":0}]
[null,null,null,null,null,null,null,null,null,null,{"$f":"Tabla13[[#This Row],[ud2]]","v":0}]
[null,null,null,null,null,null,null,null,null,null,{"$f":"Tabla13[[#This Row],[ud2]]","v":0}]
[null,null,null,null,null,null,null,null,null,null,{"$f":"Tabla13[[#This Row],[ud2]]","v":0}]
[null,null,null,null,null,null,null,null,null,null,{"$f":"Tabla13[[#This Row],[ud2]]","v":0}]
[null,null,null,null,null,null,null,null,null,null,{"$f":"Tabla13[[#This Row],[ud2]]","v":0}]
[null,null,null,null,null,null,null,null,null,null,{"$f":"Tabla13[[#This Row],[ud2]]","v":0}]
[null,null,null,null,null,null,null,null,null,null,{"$f":"Tabla13[[#This Row],[ud2]]","v":0}]
[null,null,null,null,null,null,null,null,null,null,{"$f":"Tabla13[[#This Row],[ud2]]","v":0}]
[null,null,null,null,null,null,null,null,null,null,{"$f":"Tabla13[[#This Row],[ud2]]","v":0}]
[null,null,null,null,null,null,null,null,null,null,{"$f":"Tabla13[[#This Row],[ud2]]","v":0}]
[null,null,null,null,null,null,null,null,null,null,{"$f":"Tabla13[[#This Row],[ud2]]","v":0}]
[null,null,null,null,null,null,null,null,null,null,{"$f":"Tabla13[[#This Row],[ud2]]","v":0}]

{"sheet":"ESCANDALLO","index":1,"n_rows":45,"n_cols":12,"rows_kept":45,"cut":false,"hidden":false,"merged":[[44,1,45,11],[46,1,49,11],[31,1,31,11],[32,1,33,3],[32,4,33,7],[32,8,33,11],[34,1,34,3],[34,8,43,11],[30,1,30,11],[22,1,22,6],[22,9,22,11],[23,1,23,6],[23,9,23,11],[24,1,24,6],[24,9,24,11],[25,1,26,1],[25,2,25,11],[26,2,26,11],[28,1,28,11],[29,1,29,11],[21,1,21,6],[21,9,21,11],[6,4,6,6],[6,7,6,9],[7,2,7,3],[7,4,7,5],[7,7,7,8],[7,10,7,11],[18,1,18,11],[19,1,19,6],[19,9,19,11],[20,1,20,6],[20,9,20,11],[1,1,2,11],[3,2,3,4],[3,5,5,5],[4,2,4,4],[4,6,4,7],[5,6,5,7]]}
[]
[null,"FICHA TÉCNICA + ESCANDALLO"]
[]
[null,"NOME","Data de valoración",null,null,null,null,null,null,"Tipo de servizo"]
[null,null,null,null,null,null,"Carta",null,null,"Menú",null,"Banquete"]
[null,null,null,null,null,null,"x"]
[null,null,null,null,"receta madre"]
[null,null,"%",null,"RACIONES",null,8,"RACIONES",null,25,"prezo"]
[null,"Ingredentes","Aprove","Merma","Bruto","Neto","ud","Bruto","neto","ud","compra","receta"]
[null,null,{"$f":"IF(B10=\"\",\"\",VLOOKUP(B10,lista!$A$3:$K$1100,8,0))","v":""},{"$f":"IF(C10=\"\",\"\",1-C10)","v":""},{"$f":"IF(B10=\"\",\"\",F10/C10)","v":""},null,{"$f":"IF(B10=\"\",\"\",VLOOKUP(B10,lista!$A$3:$K$1100,5,0))","v":""},{"$f":"IF(B10=\"\",\"\",I10/C10)","v":""},{"$f":"IF(B10=\"\",\"\",$J$8*F10/$G$8)","v":""},{"$f":"G10","v":""},{"$f":"IF(B10=\"\",\"\",VLOOKUP(B10,lista!$A$3:$K$1100,10,0))","v":""},{"$f":"IF(B10=\"\",\"\",K10*H10)","v":""}]
[null,null,{"$f":"IF(B11=\"\",\"\",VLOOKUP(B11,lista!$A$3:$K$1100,8,0))","v":""},{"$f":"IF(C11=\"\",\"\",1-C11)","v":""},{"$f":"IF(B11=\"\",\"\",F11/C11)","v":""},null,{"$f":"IF(B11=\"\",\"\",VLOOKUP(B11,lista!$A$3:$K$1100,5,0))","v":""},{"$f":"IF(B11=\"\",\"\",I11/C11)","v":""},{"$f":"IF(B11=\"\",\"\",$J$8*F11/$G$8)","v":""},{"$f":"G11","v":""},{"$f":"IF(B11=\"\",\"\",VLOOKUP(B11,lista!$A$3:$K$1100,10,0))","v":""},{"$f":"IF(B11=\"\",\"\",K11*H11)","v":""}]
[null,null,{"$f":"IF(B12=\"\",\"\",VLOOKUP(B12,lista!$A$3:$K$1100,8,0))","v":""},"","",null,{"$f":"IF(B12=\"\",\"\",VLOOKUP(B12,lista!$A$3:$K$1100,5,0))","v":""},"","","",{"$f":"IF(B12=\"\",\"\",VLOOKUP(B12,lista!$A$3:$K$1100,10,0))","v":""},""]
[null,null,{"$f":"IF(B13=\"\",\"\",VLOOKUP(B13,lista!$A$3:$K$1100,8,0))","v":""},"","",null,{"$f":"IF(B13=\"\",\"\",VLOOKUP(B13,lista!$A$3:$K$1100,5,0))","v":""},"","","",{"$f":"IF(B13=\"\",\"\",VLOOKUP(B13,lista!$A$3:$K$1100,10,0))","v":""},""]
[null,null,{"$f":"IF(B14=\"\",\"\",VLOOKUP(B14,lista!$A$3:$K$1100,8,0))","v":""},"","",null,{"$f":"IF(B14=\"\",\"\",VLOOKUP(B14,lista!$A$3:$K$1100,5,0))","v":""},"","","",{"$f":"IF(B14=\"\",\"\",VLOOKUP(B14,lista!$A$3:$K$1100,10,0))","v":""},""]
[null,null,{"$f":"IF(B15=\"\",\"\",VLOOKUP(B15,lista!$A$3:$K$1100,8,0))","v":""},"","",null,{"$f":"IF(B15=\"\",\"\",VLOOKUP(B15,lista!$A$3:$K$1100,5,0))","v":""},"","","",{"$f":"IF(B15=\"\",\"\",VLOOKUP(B15,lista!$A$3:$K$1100,10,0))","v":""},""]
[null,null,{"$f":"IF(B16=\"\",\"\",VLOOKUP(B16,lista!$A$3:$K$1100,8,0))","v":""},"","",null,{"$f":"IF(B16=\"\",\"\",VLOOKUP(B16,lista!$A$3:$K$1100,5,0))","v":""},"","","",{"$f":"IF(B16=\"\",\"\",VLOOKUP(B16,lista!$A$3:$K$1100,10,0))","v":""},""]
[null,null,{"$f":"IF(B17=\"\",\"\",VLOOKUP(B17,lista!$A$3:$K$1100,8,0))","v":""},"","",null,{"$f":"IF(B17=\"\",\"\",VLOOKUP(B17,lista!$A$3:$K$1100,5,0))","v":""},"","","",{"$f":"IF(B17=\"\",\"\",VLOOKUP(B17,lista!$A$3:$K$1100,10,0))","v":""},""]
[null,null,{"$f":"IF(B18=\"\",\"\",VLOOKUP(B18,lista!$A$3:$K$1100,8,0))","v":""},"","",null,{"$f":"IF(B18=\"\",\"\",VLOOKUP(B18,lista!$A$3:$K$1100,5,0))","v":""},"","","",{"$f":"IF(B18=\"\",\"\",VLOOKUP(B18,lista!$A$3:$K$1100,10,0))","v":""},""]
[null,"PROCESO ELABORACION"]
[null,"ELABORACION",null,null,null,null,null,"Tempo","Ude","PRECAUCIONS"]
[]
[]
[]
[]
[]
[null,"Mollo/gornición"]
[]
[]
[]
[]
[]
[]
[null,null,null,null,"Utensilios",null,null,null,"Foto"]
[]
[]
[null,"CUSTE M.P receita",{"$f":"SUM(L10:L18)","v":0},null,"Ceboleiro","√"]
[null,"Custe ración",{"$f":"C36/J8","v":0},null,"Puntilla","√"]
[null,"marxe erro",{"$f":"C37*D38","v":0},0.05,"Pelador","√"]
[null,"custe ración inc mx",{"$f":"C37+C38","v":0},null,"Táboa de corte","√"]
[null,"% Benef bruto",0.7,null,"Deshuesador"]
[null,"Benef bruto",{"$f":"C42-C39","v":0},null,"Rondón","√"]
[null,"PVP",{"$f":"C39/(1-C40)","v":0},null,"Espumadera","√"]
[null,"ive",{"$f":"C42*D43","v":0},0.1,"Coador ","√"]
[null,"Pvp con ive",{"$f":"C42+C43","v":0},null,"Cazo","√"]
[null,"Presentación"]

{"sheet":"ex","index":2,"n_rows":45,"n_cols":12,"rows_kept":45,"cut":false,"hidden":false,"merged":[[34,1,34,3],[34,8,43,11],[44,1,45,11],[46,1,49,11],[25,1,26,1],[25,2,25,11],[26,2,26,11],[32,1,33,3],[32,4,33,7],[32,8,33,11],[28,1,28,11],[29,1,29,11],[30,1,30,11],[31,1,31,11],[22,1,22,6],[22,9,22,11],[23,1,23,6],[23,9,23,11],[24,1,24,6],[24,9,24,11],[21,1,21,6],[21,9,21,11],[6,4,6,6],[6,7,6,9],[7,2,7,3],[7,4,7,5],[7,7,7,8],[7,10,7,11],[18,1,18,11],[19,1,19,6],[19,9,19,11],[20,1,20,6],[20,9,20,11],[1,1,2,11],[3,2,3,4],[3,5,5,5],[4,2,4,4],[4,6,4,7],[5,6,5,7]]}
[]
[null,"FICHA TÉCNICA + ESCANDALLO"]
[]
[null,"NOME","Data de valoración",null,null,null,null,null,null,"Tipo de servizo"]
[null,"PESCADA Á GALEGA",41353,null,null,null,"Carta",null,null,"Menú",null,"Banquete"]
[null,null,null,null,null,null,"x"]
[null,null,null,null,"receta madre"]
[null,null,"%",null,"RACIONES",null,1,"RACIONES",null,25,"prezo"]
[null,"Ingredientes","Aprove","Merma","Bruto","Neto","ud","Bruto","neto","ud","compra","receta"]
[null,"MERLUZA DEL PINCHO ",{"$f":"IF(B10=\"\",\"\",VLOOKUP(B10,lista!$A$3:$L$1100,8,0))","v":0.6},{"$f":"IF(C10=\"\",\"\",1-C10)","v":0.4},{"$f":"IF(B10=\"\",\"\",F10/C10)","v":0.33333333333333337},0.2,{"$f":"IF(B10=\"\",\"\",VLOOKUP(B10,lista!$A$3:$E$1100,5,0))","v":"KG"},{"$f":"IF(B10=\"\",\"\",I10/C10)","v":8.3333333333333339},{"$f":"$J$8*F10/$G$8","v":5},{"$f":"G10","v":"KG"},{"$f":"IF(B10=\"\",\"\",VLOOKUP(B10,lista!$A$3:$K$1100,10,0))","v":6.4},{"$f":"IF(B10=\"\",\"\",K10*H10)","v":53.333333333333343}]
[null,"PATATA NUEVA",{"$f":"IF(B11=\"\",\"\",VLOOKUP(B11,lista!$A$3:$L$1100,8,0))","v":0.8},{"$f":"IF(C11=\"\",\"\",1-C11)","v":0.19999999999999996},{"$f":"IF(B11=\"\",\"\",F11/C11)","v":0.74999999999999989},0.6,{"$f":"IF(B11=\"\",\"\",VLOOKUP(B11,lista!$A$3:$E$1100,5,0))","v":"KG"},{"$f":"IF(B11=\"\",\"\",I11/C11)","v":18.75},{"$f":"$J$8*F11/$G$8","v":15},{"$f":"G11","v":"KG"},{"$f":"IF(B11=\"\",\"\",VLOOKUP(B11,lista!$A$3:$K$1100,10,0))","v":0.9},{"$f":"IF(B11=\"\",\"\",K11*H11)","v":16.875}]
[null,"ACEITE  VIRGEN EXTRA",{"$f":"IF(B12=\"\",\"\",VLOOKUP(B12,lista!$A$3:$L$1100,8,0))","v":1},0,0.02,0.02,{"$f":"IF(B12=\"\",\"\",VLOOKUP(B12,lista!$A$3:$E$1100,5,0))","v":"L"},0.5,0.5,"L",{"$f":"IF(B12=\"\",\"\",VLOOKUP(B12,lista!$A$3:$K$1100,10,0))","v":3.1},1.55]
[null,"PIMENTÓN DULCE",{"$f":"IF(B13=\"\",\"\",VLOOKUP(B13,lista!$A$3:$L$1100,8,0))","v":1},0,5.0000000000000001E-3,5.0000000000000001E-3,{"$f":"IF(B13=\"\",\"\",VLOOKUP(B13,lista!$A$3:$E$1100,5,0))","v":"KG"},0.125,0.125,"KG",{"$f":"IF(B13=\"\",\"\",VLOOKUP(B13,lista!$A$3:$K$1100,10,0))","v":5.95},0.74375000000000002]
[null,"AJO",{"$f":"IF(B14=\"\",\"\",VLOOKUP(B14,lista!$A$3:$L$1100,8,0))","v":0.95},5.0000000000000044E-2,5.2631578947368429E-3,5.0000000000000001E-3,{"$f":"IF(B14=\"\",\"\",VLOOKUP(B14,lista!$A$3:$E$1100,5,0))","v":"Kg"},0.13157894736842105,0.125,"Kg",{"$f":"IF(B14=\"\",\"\",VLOOKUP(B14,lista!$A$3:$K$1100,10,0))","v":3.9},0.51315789473684204]
[null,"SAL GRUESA ",{"$f":"IF(B15=\"\",\"\",VLOOKUP(B15,lista!$A$3:$L$1100,8,0))","v":1},0,2E-3,2E-3,{"$f":"IF(B15=\"\",\"\",VLOOKUP(B15,lista!$A$3:$E$1100,5,0))","v":"KG"},0.05,0.05,"KG",{"$f":"IF(B15=\"\",\"\",VLOOKUP(B15,lista!$A$3:$K$1100,10,0))","v":0.25},1.2500000000000001E-2]
[null,null,{"$f":"IF(B16=\"\",\"\",VLOOKUP(B16,lista!$A$3:$L$1100,8,0))","v":""},{"$f":"IF(C16=\"\",\"\",1-C16)","v":""},{"$f":"IF(B16=\"\",\"\",F16/C16)","v":""},null,{"$f":"IF(B16=\"\",\"\",VLOOKUP(B16,lista!$A$3:$E$1100,5,0))","v":""},{"$f":"IF(B16=\"\",\"\",I16/C16)","v":""},{"$f":"$J$8*F16/$G$8","v":0},{"$f":"G16","v":""},{"$f":"IF(B16=\"\",\"\",VLOOKUP(B16,lista!$A$3:$K$1100,10,0))","v":""},{"$f":"IF(B16=\"\",\"\",K16*H16)","v":""}]
[null,null,{"$f":"IF(B17=\"\",\"\",VLOOKUP(B17,lista!$A$3:$L$1100,8,0))","v":""},"","",null,{"$f":"IF(B17=\"\",\"\",VLOOKUP(B17,lista!$A$3:$E$1100,5,0))","v":""},"",0,"",{"$f":"IF(B17=\"\",\"\",VLOOKUP(B17,lista!$A$3:$K$1100,10,0))","v":""},""]
[null,null,{"$f":"IF(B18=\"\",\"\",VLOOKUP(B18,lista!$A$3:$L$1100,8,0))","v":""},"","",null,{"$f":"IF(B18=\"\",\"\",VLOOKUP(B18,lista!$A$3:$E$1100,5,0))","v":""},"",0,"",{"$f":"IF(B18=\"\",\"\",VLOOKUP(B18,lista!$A$3:$K$1100,10,0))","v":""},""]
[null,"PROCESO ELABORACION"]
[null,"ELABORACION",null,null,null,null,null,"Tempo","Ude","PRECAUCIONS"]
[null,"1. Limpar a pescada e cortar toros de 200 gr. Refrixerar.",null,null,null,null,null,6,"min"]
[null,"2. Pelar patacas e cortar tamén en toros regulares.",null,null,null,null,null,4]
[null,"3.Sobre comanda, pór as patacas a cocer co sal e o loureiro.",null,null,null,null,null,16]
[null,"4. Cando case estean as patacas amécese a pescada. Ao ferver retirar do lume e agardar 2'.",null,null,null,null,null,2]
[null,"5. Escorrer, empratar e salsear coa allada. ",null,null,null,null,null,1]
[null,"Mollo/gornición"]
[]
[null,"1. Atemperar o aceite cos allos enteiros pero lixeiramente esmagados. Manter 30' sen superar os 100ºC"]
[null,"2. Amecer o pementón e remexer.Deixar infusionar."]
[null,"3. Coar e decantar, reservando os dentes de allo."]
[]
[]
[null,null,null,null,"Utensilios",null,null,null,"Foto"]
[]
[]
[null,"CUSTE M.P receita",{"$f":"SUM(L10:L18)","v":73.027741228070184},null,"Ceboleiro","√"]
[null,"Custe ración",{"$f":"C36/J8","v":2.9211096491228075},null,"Puntilla","√"]
[null,"marxe erro",{"$f":"C37*D38","v":0.14605548245614039},0.05,"Pelador","√"]
[null,"custe ración inc mx",{"$f":"C37+C38","v":3.0671651315789479},null,"Táboa de corte","√"]
[null,"% Benef bruto",0.65,null,"Deshuesador"]
[null,"Benef bruto",{"$f":"C42-C39","v":5.6961638157894754},null,"Rondón","√"]
[null,"PVP",{"$f":"C39/(1-C40)","v":8.7633289473684233},null,"Espumadera","√"]
[null,"ive",{"$f":"C42*D43","v":0.87633289473684239},0.1,"Coador ","√"]
[null,"Pvp con ive",{"$f":"C42+C43","v":9.6396618421052658},null,"Cazo","√"]
[null,"Presentación"]

{"sheet":"Hoja2","index":3,"n_rows":0,"n_cols":0,"rows_kept":0,"cut":false,"hidden":false,"merged":[]}