{"text_format":"1","workbook":"xlsx","n_sheets":4,"sheets":["lista","ESCANDALLO","ex","Hoja2"],"not_rendered":{"charts":0,"images":1,"macros":1,"external_links":0,"defined_names":1,"comments":1,"pivot_tables":0},"unopened":[],"bounds":{"document_bytes":16777216,"sheet_cells":100000,"rows_first":2000,"rows_last":500,"rows_between":2000,"halvings":0,"cell_chars":16384,"cell_head_chars":4096},"cells_cut":0,"cells_raw":0,"read":"whole","date_system":"1900"}

{"sheet":"lista","index":0,"n_rows":828,"n_cols":11,"rows_kept":828,"cut":false,"hidden":false,"merged":[[2,5,2,8]]}
[]
[]
[null,null,"Ref FACTURA",null,null,"Ref cocina",null,null,null,"precio","ud"]
["ARTICULO","Formato","Ud","coste","ud2","Bruto","Neto","% Apvto","Merma","Columna3","Columna4"]
[]
["ABADEJO",1,"Kg",8.9600000000000009,{"$f":"Tabla13[[#This Row],[Ud]]","v":"Kg"},1,0.7,{"$f":"Tabla13[[#This Row],[Neto]]/Tabla13[[#This Row],[Bruto]]","v":0.7},{"$f":"1-H6","v":0.30000000000000004},{"$f":"(1*D6)/B6","v":8.9600000000000009},{"$f":"Tabla13[[#This Row],[ud2]]","v":"Kg"}]
["ACEITE  VIRGEN EXTRA",1,"L",3.1,{"$f":"Tabla13[[#This Row],[Ud]]","v":"L"},1,1,{"$f":"Tabla13[[#This Row],[Neto]]/Tabla13[[#This Row],[Bruto]]","v":1},0,3.1,{"$f":"Tabla13[[#This Row],[ud2]]","v":"L"}]
["ACEITE DE SESÁMO",0.15,"L",5.0999999999999996,{"$f":"Tabla13[[#This Row],[Ud]]","v":"L"},1,1,{"$f":"Tabla13[[#This Row],[Neto]]/Tabla13[[#This Row],[Bruto]]","v":1},0,34,{"$f":"Tabla13[[#This Row],[ud2]]","v":"L"}]
["ACEITE GIRASOL",1,"L",1.5529999999999999,{"$f":"Tabla13[[#This Row],[Ud]]","v":"L"},1,1,{"$f":"Tabla13[[#This Row],[Neto]]/Tabla13[[#This Row],[Bruto]]","v":1},0,1.5529999999999999,{"$f":"Tabla13[[#This Row],[ud2]]","v":"L"}]
["ACEITE OLIVA",1,"L",3.05,{"$f":"Tabla13[[#This Row],[Ud]]","v":"L"},1,1,{"$f":"Tabla13[[#This Row],[Neto]]/Tabla13[[#This Row],[Bruto]]","v":1},0,3.05,{"$f":"Tabla13[[#This Row],[ud2]]","v":"L"}]
["ACEITE VAL DE QUIROGA",1,"L",11.77,{"$f":"Tabla13[[#This Row],[Ud]]","v":"L"},1,1,{"$f":"Tabla13[[#This Row],[Neto]]/Tabla13[[#This Row],[Bruto]]","v":1},0,11.77,{"$f":"Tabla13[[#This Row],[ud2]]","v":"L"}]
["ACEITUNA NEGRA C/ HUESO",0.15,"Kg",0.63,{"$f":"Tabla13[[#This Row],[Ud]]","v":"Kg"},1,1,{"$f":"Tabla13[[#This Row],[Neto]]/Tabla13[[#This Row],[Bruto]]","v":1},0,4.2,{"$f":"Tabla13[[#This Row],[ud2]]","v":"Kg"}]
["ACEITUNA NEGRA S/ HUESO",0.15,"Kg",1.08,{"$f":"Tabla13[[#This Row],[Ud]]","v":"Kg"},1,1,{"$f":"Tabla13[[#This Row],[Neto]]/Tabla13[[#This Row],[Bruto]]","v":1},0,7.2000000000000011,{"$f":"Tabla13[[#This Row],[ud2]]","v":"Kg"}]
["ACEITUNA VERDE C/ ANCHOA",0.15,"Kg",{"$f":"(0.93+0.52)/2","v":0.72500000000000009},{"$f":"Tabla13[[#This Row],[Ud]]","v":"Kg"},1,1,{"$f":"Tabla13[[#This Row],[Neto]]/Tabla13[[#This Row],[Bruto]]","v":1},0,4.8333333333333339,{"$f":"Tabla13[[#This Row],[ud2]]","v":"Kg"}]
["ACEITUNAS VERDE C/ HUESO",0.5,"Kg",1.49,{"$f":"Tabla13[[#This Row],[Ud]]","v":"Kg"},1,1,{"$f":"Tabla13[[#This Row],[Neto]]/Tabla13[[#This Row],[Bruto]]","v":1},0,2.98,{"$f":"Tabla13[[#This Row],[ud2]]","v":"Kg"}]
["ACEITUNAS VERDE S/ HUESO",0.13,"Kg",0.77,{"$f":"Tabla13[[#This Row],[Ud]]","v":"Kg"},1,1,{"$f":"Tabla13[[#This Row],[Neto]]/Tabla13[[#This Row],[Bruto]]","v":1},0,5.9230769230769234,{"$f":"Tabla13[[#This Row],[ud2]]","v":"Kg"}]
["ACELGAS",1,"Kg",0.99,{"$f":"Tabla13[[#This Row],[Ud]]","v":"Kg"},1,0.95,{"$f":"Tabla13[[#This Row],[Neto]]/Tabla13[[#This Row],[Bruto]]","v":0.95},5.0000000000000044E-2,0.99,{"$f":"Tabla13[[#This Row],[ud2]]","v":"Kg"}]
["ACHICORIA",1,"Kg",1.3,{"$f":"Tabla13[[#This Row],[Ud]]","v":"Kg"},1,1,{"$f":"Tabla13[[#This Row],[Neto]]/Tabla13[[#This Row],[Bruto]]","v":1},0,1.3,{"$f":"Tabla13[[#This Row],[ud2]]","v":"Kg"}]
["AFAZRÁN EN RAMA",0.32500000000000001,"Kg",1.35,{"$f":"Tabla13[[#This Row],[Ud]]","v":"Kg"},1,1,{"$f":"Tabla13[[#This Row],[Neto]]/Tabla13[[#This Row],[Bruto]]","v":1},0,4.1538461538461542,{"$f":"Tabla13[[#This Row],[ud2]]","v":"Kg"}]
["AGUACATE",1,"Kg",{"$f":"(3.64+4.056)/2","v":3.8479999999999999},{"$f":"Tabla13[[#This Row],[Ud]]","v":"Kg"},1,0.7,{"$f":"Tabla13[[#This Row],[Neto]]/Tabla13[[#This Row],[Bruto]]","v":0.7},0.30000000000000004,3.8479999999999999,{"$f":"Tabla13[[#This Row],[ud2]]","v":"Kg"}]
["AGUJA DE CERDO C/ HUESO",1,"Kg",3.9,{"$f":"Tabla13[[#This Row],[Ud]]","v":"Kg"},1,0.9,{"$f":"Tabla13[[#This Row],[Neto]]/Tabla13[[#This Row],[Bruto]]","v":0.9},9.9999999999999978E-2,3.9,{"$f":"Tabla13[[#This Row],[ud2]]","v":"Kg"}]
["AGUJA DE CERDO S/ HUESO",1,"Kg",3.99,{"$f":"Tabla13[[#This Row],[Ud]]","v":"Kg"},1,0.9,{"$f":"Tabla13[[#This Row],[Neto]]/Tabla13[[#This Row],[Bruto]]","v":0.9},9.9999999999999978E-2,3.99,{"$f":"Tabla13[[#This Row],[ud2]]","v":"Kg"}]
["AGUJA DE TERNERA S/ HUESO",1,"Kg",5.5,{"$f":"Tabla13[[#This Row],[Ud]]","v":"Kg"},1,0.9,{"$f":"Tabla13[[#This Row],[Neto]]/Tabla13[[#This Row],[Bruto]]","v":0.9},9.9999999999999978E-2,5.5,{"$f":"Tabla13[[#This Row],[ud2]]","v":"Kg"}]
["AJO",1,"Kg",3.9,{"$f":"Tabla13[[#This Row],[Ud]]","v":"Kg"},1,0.95,{"$f":"Tabla13[[#This Row],[Neto]]/Tabla13[[#This Row],[Bruto]]","v":0.95},{"$f":"1-H24","v":5.0000000000000044E-2},{"$f":"(1*D24)/B24","v":3.9},{"$f":"Tabla13[[#This Row],[ud2]]","v":"Kg"}]
["AJO MOLIDO",0.5,"Kg",5.39,{"$f":"Tabla13[[#This Row],[Ud]]","v":"Kg"},1,1,{"$f":"Tabla13[[#This Row],[Neto]]/Tabla13[[#This Row],[Bruto]]","v":1},0,10.78,{"$f":"Tabla13[[#This Row],[ud2]]","v":"Kg"}]
["ALBAHACA",1,"Kg",2.5680000000000001,{"$f":"Tabla13[[#This Row],[Ud]]","v":"Kg"},1,1,{"$f":"Tabla13[[#This Row],[Neto]]/Tabla13[[#This Row],[Bruto]]","v":1},0,2.5680000000000001,{"$f":"Tabla13[[#This Row],[ud2]]","v":"Kg"}]
["ALCACHOFAS CONGELADAS",0.45,"Kg",2.6,{"$f":"Tabla13[[#This Row],[Ud]]","v":"Kg"},1,0.95,{"$f":"Tabla13[[#This Row],[Neto]]/Tabla13[[#This Row],[Bruto]]","v":0.95},5.0000000000000044E-2,5.7777777777777777,{"$f":"Tabla13[[#This Row],[ud2]]","v":"Kg"}]
["ALCACHOFAS CONSERVA",0.33,"Kg",1.35,{"$f":"Tabla13[[#This Row],[Ud]]","v":"Kg"},1,1,{"$f":"Tabla13[[#This Row],[Neto]]/Tabla13[[#This Row],[Bruto]]","v":1},0,4.0909090909090908,{"$f":"Tabla13[[#This Row],[ud2]]","v":"Kg"}]
["ALCAPARRAS",0.14499999999999999,"Kg",1.46,{"$f":"Tabla13[[#This Row],[Ud]]","v":"Kg"},1,1,{"$f":"Tabla13[[#This Row],[Neto]]/Tabla13[[#This Row],[Bruto]]","v":1},0,10.068965517241379,{"$f":"Tabla13[[#This Row],[ud2]]","v":"Kg"}]
["ALFALFA",0.15,"Kg",2.21,{"$f":"Tabla13[[#This Row],[Ud]]","v":"Kg"},1,1,{"$f":"Tabla13[[#This Row],[Neto]]/Tabla13[[#This Row],[Bruto]]","v":1},0,14.733333333333334,{"$f":"Tabla13[[#This Row],[ud2]]","v":"Kg"}]
["ALGA NORI",0.05,"Kg",3.25,{"$f":"Tabla13[[#This Row],[Ud]]","v":"Kg"},1,1,{"$f":"Tabla13[[#This Row],[Neto]]/Tabla13[[#This Row],[Bruto]]","v":1},0,65,{"$f":"Tabla13[[#This Row],[ud2]]","v":"Kg"}]
["APIO-NABO",1,"Kg",1.9239999999999999,{"$f":"Tabla13[[#This Row],[Ud]]","v":"Kg"},1,0.8,{"$f":"Tabla13[[#This Row],[Neto]]/Tabla13[[#This Row],[Bruto]]","v":0.8},0.19999999999999996,1.9239999999999999,{"$f":"Tabla13[[#This Row],[ud2]]","v":"Kg"}]
["BOLETUS EDULIS CONGELADO",1,"Kg",19.588999999999999,{"$f":"Tabla13[[#This Row],[Ud]]","v":"Kg"},1,1,{"$f":"Tabla13[[#This Row],[Neto]]/Tabla13[[#This Row],[Bruto]]","v":1},0,19.588999999999999,{"$f":"Tabla13[[#This Row],[ud2]]","v":"Kg"}]
["BONITO NORTE",1,"Kg",13,{"$f":"Tabla13[[#This Row],[Ud]]","v":"Kg"},1,0.7,{"$f":"Tabla13[[#This Row],[Neto]]/Tabla13[[#This Row],[Bruto]]","v":0.7},0.30000000000000004,13,{"$f":"Tabla13[[#This Row],[ud2]]","v":"Kg"}]
["BOQUERÓN",1,"Kg",7.9,{"$f":"Tabla13[[#This Row],[Ud]]","v":"Kg"},1,0.7,{"$f":"Tabla13[[#This Row],[Neto]]/Tabla13[[#This Row],[Bruto]]","v":0.7},0.30000000000000004,7.9,{"$f":"Tabla13[[#This Row],[ud2]]","v":"Kg"}]
["BRANDY",0.7,"L",5.51,{"$f":"Tabla13[[#This Row],[Ud]]","v":"L"},1,1,{"$f":"Tabla13[[#This Row],[Neto]]/Tabla13[[#This Row],[Bruto]]","v":1},0,7.8714285714285719,{"$f":"Tabla13[[#This Row],[ud2]]","v":"L"}]
["BRECOL",1,"Kg",1.72,{"$f":"Tabla13[[#This Row],[Ud]]","v":"Kg"},1,0.9,{"$f":"Tabla13[[#This Row],[Neto]]/Tabla13[[#This Row],[Bruto]]","v":0.9},9.9999999999999978E-2,1.72,{"$f":"Tabla13[[#This Row],[ud2]]","v":"Kg"}]
["BRILLO PASTELERÍA",5,"Kg",21.24,{"$f":"Tabla13[[#This Row],[Ud]]","v":"Kg"},1,1,{"$f":"Tabla13[[#This Row],[Neto]]/Tabla13[[#This Row],[Bruto]]","v":1},0,4.2479999999999993,{"$f":"Tabla13[[#This Row],[ud2]]","v":"Kg"}]
["BROTES DE SOJA",0.18,"Gr",1.36,{"$f":"Tabla13[[#This Row],[Ud]]","v":"Gr"},1,1,{"$f":"Tabla13[[#This Row],[Neto]]/Tabla13[[#This Row],[Bruto]]","v":1},0,7.5555555555555562,{"$f":"Tabla13[[#This Row],[ud2]]","v":"Gr"}]
["BUEI DE MAR",0.7,"Ud",5.94,{"$f":"Tabla13[[#This Row],[Ud]]","v":"Ud"},1,1,{"$f":"Tabla13[[#This Row],[Neto]]/Tabla13[[#This Row],[Bruto]]","v":1},0,8.4857142857142875,{"$f":"Tabla13[[#This Row],[ud2]]","v":"Ud"}]
["BUTELO",1,"Kg",10.51,{"$f":"Tabla13[[#This Row],[Ud]]","v":"Kg"},1,1,{"$f":"Tabla13[[#This Row],[Neto]]/Tabla13[[#This Row],[Bruto]]","v":1},0,10.51,{"$f":"Tabla13[[#This Row],[ud2]]","v":"Kg"}]
["CABALLA",1,"Kg",4,{"$f":"Tabla13[[#This Row],[Ud]]","v":"Kg"},1,0.75,{"$f":"Tabla13[[#This Row],[Neto]]/Tabla13[[#This Row],[Bruto]]","v":0.75},0.25,4,{"$f":"Tabla13[[#This Row],[ud2]]","v":"Kg"}]
["CABALLA",1,"KG",4,{"$f":"Tabla13[[#This Row],[Ud]]","v":"KG"},1,0.7,{"$f":"G43/F43","v":0.7},0.30000000000000004,4,{"$f":"Tabla13[[#This Row],[ud2]]","v":"KG"}]
["CABELLO DE ANGEL",0.85,"Kg",2.1379999999999999,{"$f":"Tabla13[[#This Row],[Ud]]","v":"Kg"},1,1,{"$f":"Tabla13[[#This Row],[Neto]]/Tabla13[[#This Row],[Bruto]]","v":1},0,2.5152941176470587,{"$f":"Tabla13[[#This Row],[ud2]]","v":"Kg"}]
["CABRACHO",2.6,"Kg",17.39,{"$f":"Tabla13[[#This Row],[Ud]]","v":"Kg"},1,0.75,{"$f":"Tabla13[[#This Row],[Neto]]/Tabla13[[#This Row],[Bruto]]","v":0.75},0.25,6.6884615384615387,{"$f":"Tabla13[[#This Row],[ud2]]","v":"Kg"}]
["CACAHUETE FRITO",0.25,"Gr",1.57,{"$f":"Tabla13[[#This Row],[Ud]]","v":"Gr"},1,1,{"$f":"Tabla13[[#This Row],[Neto]]/Tabla13[[#This Row],[Bruto]]","v":1},0,6.28,{"$f":"Tabla13[[#This Row],[ud2]]","v":"Gr"}]
["CACAO EN POLVO",1,"Kg",3,{"$f":"Tabla13[[#This Row],[Ud]]","v":"Kg"},1,1,{"$f":"Tabla13[[#This Row],[Neto]]/Tabla13[[#This Row],[Bruto]]","v":1},0,3,{"$f":"Tabla13[[#This Row],[ud2]]","v":"Kg"}]
["CACHOLA CERDO SALADA",1,"Kg",2.74,{"$f":"Tabla13[[#This Row],[Ud]]","v":"Kg"},1,1,{"$f":"Tabla13[[#This Row],[Neto]]/Tabla13[[#This Row],[Bruto]]","v":1},0,2.74,{"$f":"Tabla13[[#This Row],[ud2]]","v":"Kg"}]
["CALABACÍN",1,"Kg",1.04,{"$f":"Tabla13[[#This Row],[Ud]]","v":"Kg"},1,0.95,{"$f":"Tabla13[[#This Row],[Neto]]/Tabla13[[#This Row],[Bruto]]","v":0.95},5.0000000000000044E-2,1.04,{"$f":"Tabla13[[#This Row],[ud2]]","v":"Kg"}]
["CALABAZA",1,"Kg",1.04,{"$f":"Tabla13[[#This Row],[Ud]]","v":"Kg"},1,0.85,{"$f":"Tabla13[[#This Row],[Neto]]/Tabla13[[#This Row],[Bruto]]","v":0.85},0.15000000000000002,1.04,{"$f":"Tabla13[[#This Row],[ud2]]","v":"Kg"}]
["CALAMAR CONGELADO, TUBO",1,"KG",6.5,{"$f":"Tabla13[[#This Row],[Ud]]","v":"KG"},1,1,{"$f":"G51/F51","v":1},0,6.5,{"$f":"Tabla13[[#This Row],[ud2]]","v":"KG"}]
["CALLOS",1,"Kg",4.8,{"$f":"Tabla13[[#This Row],[Ud]]","v":"Kg"},1,1,{"$f":"Tabla13[[#This Row],[Neto]]/Tabla13[[#This Row],[Bruto]]","v":1},0,4.8,{"$f":"Tabla13[[#This Row],[ud2]]","v":"Kg"}]
["CANELA EN RAMA",0.3,"Kg",7.74,{"$f":"Tabla13[[#This Row],[Ud]]","v":"Kg"},1,1,{"$f":"Tabla13[[#This Row],[Neto]]/Tabla13[[#This Row],[Bruto]]","v":1},0,25.8,{"$f":"Tabla13[[#This Row],[ud2]]","v":"Kg"}]
["CANELA MOLIDA",0.85199999999999998,"Kg",3.5840000000000001,{"$f":"Tabla13[[#This Row],[Ud]]","v":"Kg"},1,1,{"$f":"Tabla13[[#This Row],[Neto]]/Tabla13[[#This Row],[Bruto]]","v":1},0,4.206572769953052,{"$f":"Tabla13[[#This Row],[ud2]]","v":"Kg"}]
["CANELONES",120,"Ud",7.1150000000000002,{"$f":"Tabla13[[#This Row],[Ud]]","v":"Ud"},1,1,{"$f":"Tabla13[[#This Row],[Neto]]/Tabla13[[#This Row],[Bruto]]","v":1},0,5.9291666666666666E-2,{"$f":"Tabla13[[#This Row],[ud2]]","v":"Ud"}]
["CANÓNIGOS",0.12,"Kg",1.29,{"$f":"Tabla13[[#This Row],[Ud]]","v":"Kg"},1,1,{"$f":"Tabla13[[#This Row],[Neto]]/Tabla13[[#This Row],[Bruto]]","v":1},0,10.75,{"$f":"Tabla13[[#This Row],[ud2]]","v":"Kg"}]
["CANÓNIGOS",1,"BOLSA",1.7250000000000001,{"$f":"Tabla13[[#This Row],[Ud]]","v":"BOLSA"},1,1,{"$f":"G57/F57","v":1},0,1.7250000000000001,{"$f":"Tabla13[[#This Row],[ud2]]","v":"BOLSA"}]
["CANUTILLOS DE CHOCOLATE",0.1,"Kg",0.96,{"$f":"Tabla13[[#This Row],[Ud]]","v":"Kg"},1,1,{"$f":"Tabla13[[#This Row],[Neto]]/Tabla13[[#This Row],[Bruto]]","v":1},0,9.6,{"$f":"Tabla13[[#This Row],[ud2]]","v":"Kg"}]
["CARACOLES CONGELADOS",0.45,"Kg",3,{"$f":"Tabla13[[#This Row],[Ud]]","v":"Kg"},1,1,{"$f":"Tabla13[[#This Row],[Neto]]/Tabla13[[#This Row],[Bruto]]","v":1},0,6.6666666666666661,{"$f":"Tabla13[[#This Row],[ud2]]","v":"Kg"}]
["CARAMELO LÍQUIDO",0.4,"Kg",1.79,{"$f":"Tabla13[[#This Row],[Ud]]","v":"Kg"},1,1,{"$f":"Tabla13[[#This Row],[Neto]]/Tabla13[[#This Row],[Bruto]]","v":1},0,4.4749999999999996,{"$f":"Tabla13[[#This Row],[ud2]]","v":"Kg"}]
{"$rows_left_out":769}
{"sheet":"ESCANDALLO","index":1,"n_rows":45,"n_cols":12,"rows_kept":45,"cut":false,"hidden":false,"merged":[[44,1,45,11],[46,1,49,11],[31,1,31,11],[32,1,33,3],[32,4,33,7],[32,8,33,11],[34,1,34,3],[34,8,43,11],[30,1,30,11],[22,1,22,6],[22,9,22,11],[23,1,23,6],[23,9,23,11],[24,1,24,6],[24,9,24,11],[25,1,26,1],[25,2,25,11],[26,2,26,11],[28,1,28,11],[29,1,29,11],[21,1,21,6],[21,9,21,11],[6,4,6,6],[6,7,6,9],[7,2,7,3],[7,4,7,5],[7,7,7,8],[7,10,7,11],[18,1,18,11],[19,1,19,6],[19,9,19,11],[20,1,20,6],[20,9,20,11],[1,1,2,11],[3,2,3,4],[3,5,5,5],[4,2,4,4],[4,6,4,7],[5,6,5,7]]}
[]
[null,"FICHA TÉCNICA + ESCANDALLO"]
[]
[null,"NOME","Data de valoración",null,null,null,null,null,null,"Tipo de servizo"]
[null,null,null,null,null,null,"Carta",null,null,"Menú",null,"Banquete"]
[null,null,null,null,null,null,"x"]
[null,null,null,null,"receta madre"]
[null,null,"%",null,"RACIONES",null,8,"RACIONES",null,25,"prezo"]
[null,"Ingredentes","Aprove","Merma","Bruto","Neto","ud","Bruto","neto","ud","compra","receta"]
[null,null,{"$f":"IF(B10=\"\",\"\",VLOOKUP(B10,lista!$A$3:$K$1100,8,0))","v":""},{"$f":"IF(C10=\"\",\"\",1-C10)","v":""},{"$f":"IF(B10=\"\",\"\",F10/C10)","v":""},null,{"$f":"IF(B10=\"\",\"\",VLOOKUP(B10,lista!$A$3:$K$1100,5,0))","v":""},{"$f":"IF(B10=\"\",\"\",I10/C10)","v":""},{"$f":"IF(B10=\"\",\"\",$J$8*F10/$G$8)","v":""},{"$f":"G10","v":""},{"$f":"IF(B10=\"\",\"\",VLOOKUP(B10,lista!$A$3:$K$1100,10,0))","v":""},{"$f":"IF(B10=\"\",\"\",K10*H10)","v":""}]
[null,null,{"$f":"IF(B11=\"\",\"\",VLOOKUP(B11,lista!$A$3:$K$1100,8,0))","v":""},{"$f":"IF(C11=\"\",\"\",1-C11)","v":""},{"$f":"IF(B11=\"\",\"\",F11/C11)","v":""},null,{"$f":"IF(B11=\"\",\"\",VLOOKUP(B11,lista!$A$3:$K$1100,5,0))","v":""},{"$f":"IF(B11=\"\",\"\",I11/C11)","v":""},{"$f":"IF(B11=\"\",\"\",$J$8*F11/$G$8)","v":""},{"$f":"G11","v":""},{"$f":"IF(B11=\"\",\"\",VLOOKUP(B11,lista!$A$3:$K$1100,10,0))","v":""},{"$f":"IF(B11=\"\",\"\",K11*H11)","v":""}]
[null,null,{"$f":"IF(B12=\"\",\"\",VLOOKUP(B12,lista!$A$3:$K$1100,8,0))","v":""},"","",null,{"$f":"IF(B12=\"\",\"\",VLOOKUP(B12,lista!$A$3:$K$1100,5,0))","v":""},"","","",{"$f":"IF(B12=\"\",\"\",VLOOKUP(B12,lista!$A$3:$K$1100,10,0))","v":""},""]
[null,null,{"$f":"IF(B13=\"\",\"\",VLOOKUP(B13,lista!$A$3:$K$1100,8,0))","v":""},"","",null,{"$f":"IF(B13=\"\",\"\",VLOOKUP(B13,lista!$A$3:$K$1100,5,0))","v":""},"","","",{"$f":"IF(B13=\"\",\"\",VLOOKUP(B13,lista!$A$3:$K$1100,10,0))","v":""},""]
[null,null,{"$f":"IF(B14=\"\",\"\",VLOOKUP(B14,lista!$A$3:$K$1100,8,0))","v":""},"","",null,{"$f":"IF(B14=\"\",\"\",VLOOKUP(B14,lista!$A$3:$K$1100,5,0))","v":""},"","","",{"$f":"IF(B14=\"\",\"\",VLOOKUP(B14,lista!$A$3:$K$1100,10,0))","v":""},""]
[null,null,{"$f":"IF(B15=\"\",\"\",VLOOKUP(B15,lista!$A$3:$K$1100,8,0))","v":""},"","",null,{"$f":"IF(B15=\"\",\"\",VLOOKUP(B15,lista!$A$3:$K$1100,5,0))","v":""},"","","",{"$f":"IF(B15=\"\",\"\",VLOOKUP(B15,lista!$A$3:$K$1100,10,0))","v":""},""]
[null,null,{"$f":"IF(B16=\"\",\"\",VLOOKUP(B16,lista!$A$3:$K$1100,8,0))","v":""},"","",null,{"$f":"IF(B16=\"\",\"\",VLOOKUP(B16,lista!$A$3:$K$1100,5,0))","v":""},"","","",{"$f":"IF(B16=\"\",\"\",VLOOKUP(B16,lista!$A$3:$K$1100,10,0))","v":""},""]
[null,null,{"$f":"IF(B17=\"\",\"\",VLOOKUP(B17,lista!$A$3:$K$1100,8,0))","v":""},"","",null,{"$f":"IF(B17=\"\",\"\",VLOOKUP(B17,lista!$A$3:$K$1100,5,0))","v":""},"","","",{"$f":"IF(B17=\"\",\"\",VLOOKUP(B17,lista!$A$3:$K$1100,10,0))","v":""},""]
[null,null,{"$f":"IF(B18=\"\",\"\",VLOOKUP(B18,lista!$A$3:$K$1100,8,0))","v":""},"","",null,{"$f":"IF(B18=\"\",\"\",VLOOKUP(B18,lista!$A$3:$K$1100,5,0))","v":""},"","","",{"$f":"IF(B18=\"\",\"\",VLOOKUP(B18,lista!$A$3:$K$1100,10,0))","v":""},""]
[null,"PROCESO ELABORACION"]
[null,"ELABORACION",null,null,null,null,null,"Tempo","Ude","PRECAUCIONS"]
[]
[]
[]
[]
[]
[null,"Mollo/gornición"]
[]
[]
[]
[]
[]
[]
[null,null,null,null,"Utensilios",null,null,null,"Foto"]
[]
[]
[null,"CUSTE M.P receita",{"$f":"SUM(L10:L18)","v":0},null,"Ceboleiro","√"]
[null,"Custe ración",{"$f":"C36/J8","v":0},null,"Puntilla","√"]
[null,"marxe erro",{"$f":"C37*D38","v":0},0.05,"Pelador","√"]
[null,"custe ración inc mx",{"$f":"C37+C38","v":0},null,"Táboa de corte","√"]
[null,"% Benef bruto",0.7,null,"Deshuesador"]
[null,"Benef bruto",{"$f":"C42-C39","v":0},null,"Rondón","√"]
[null,"PVP",{"$f":"C39/(1-C40)","v":0},null,"Espumadera","√"]
[null,"ive",{"$f":"C42*D43","v":0},0.1,"Coador ","√"]
[null,"Pvp con ive",{"$f":"C42+C43","v":0},null,"Cazo","√"]
[null,"Presentación"]

{"sheet":"ex","index":2,"n_rows":45,"n_cols":12,"rows_kept":45,"cut":false,"hidden":false,"merged":[[34,1,34,3],[34,8,43,11],[44,1,45,11],[46,1,49,11],[25,1,26,1],[25,2,25,11],[26,2,26,11],[32,1,33,3],[32,4,33,7],[32,8,33,11],[28,1,28,11],[29,1,29,11],[30,1,30,11],[31,1,31,11],[22,1,22,6],[22,9,22,11],[23,1,23,6],[23,9,23,11],[24,1,24,6],[24,9,24,11],[21,1,21,6],[21,9,21,11],[6,4,6,6],[6,7,6,9],[7,2,7,3],[7,4,7,5],[7,7,7,8],[7,10,7,11],[18,1,18,11],[19,1,19,6],[19,9,19,11],[20,1,20,6],[20,9,20,11],[1,1,2,11],[3,2,3,4],[3,5,5,5],[4,2,4,4],[4,6,4,7],[5,6,5,7]]}
[]
[null,"FICHA TÉCNICA + ESCANDALLO"]
[]
[null,"NOME","Data de valoración",null,null,null,null,null,null,"Tipo de servizo"]
[null,"PESCADA Á GALEGA",41353,null,null,null,"Carta",null,null,"Menú",null,"Banquete"]
[null,null,null,null,null,null,"x"]
[null,null,null,null,"receta madre"]
[null,null,"%",null,"RACIONES",null,1,"RACIONES",null,25,"prezo"]
[null,"Ingredientes","Aprove","Merma","Bruto","Neto","ud","Bruto","neto","ud","compra","receta"]
[null,"MERLUZA DEL PINCHO ",{"$f":"IF(B10=\"\",\"\",VLOOKUP(B10,lista!$A$3:$L$1100,8,0))","v":0.6},{"$f":"IF(C10=\"\",\"\",1-C10)","v":0.4},{"$f":"IF(B10=\"\",\"\",F10/C10)","v":0.33333333333333337},0.2,{"$f":"IF(B10=\"\",\"\",VLOOKUP(B10,lista!$A$3:$E$1100,5,0))","v":"KG"},{"$f":"IF(B10=\"\",\"\",I10/C10)","v":8.3333333333333339},{"$f":"$J$8*F10/$G$8","v":5},{"$f":"G10","v":"KG"},{"$f":"IF(B10=\"\",\"\",VLOOKUP(B10,lista!$A$3:$K$1100,10,0))","v":6.4},{"$f":"IF(B10=\"\",\"\",K10*H10)","v":53.333333333333343}]
[null,"PATATA NUEVA",{"$f":"IF(B11=\"\",\"\",VLOOKUP(B11,lista!$A$3:$L$1100,8,0))","v":0.8},{"$f":"IF(C11=\"\",\"\",1-C11)","v":0.19999999999999996},{"$f":"IF(B11=\"\",\"\",F11/C11)","v":0.74999999999999989},0.6,{"$f":"IF(B11=\"\",\"\",VLOOKUP(B11,lista!$A$3:$E$1100,5,0))","v":"KG"},{"$f":"IF(B11=\"\",\"\",I11/C11)","v":18.75},{"$f":"$J$8*F11/$G$8","v":15},{"$f":"G11","v":"KG"},{"$f":"IF(B11=\"\",\"\",VLOOKUP(B11,lista!$A$3:$K$1100,10,0))","v":0.9},{"$f":"IF(B11=\"\",\"\",K11*H11)","v":16.875}]
[null,"ACEITE  VIRGEN EXTRA",{"$f":"IF(B12=\"\",\"\",VLOOKUP(B12,lista!$A$3:$L$1100,8,0))","v":1},0,0.02,0.02,{"$f":"IF(B12=\"\",\"\",VLOOKUP(B12,lista!$A$3:$E$1100,5,0))","v":"L"},0.5,0.5,"L",{"$f":"IF(B12=\"\",\"\",VLOOKUP(B12,lista!$A$3:$K$1100,10,0))","v":3.1},1.55]
[null,"PIMENTÓN DULCE",{"$f":"IF(B13=\"\",\"\",VLOOKUP(B13,lista!$A$3:$L$1100,8,0))","v":1},0,5.0000000000000001E-3,5.0000000000000001E-3,{"$f":"IF(B13=\"\",\"\",VLOOKUP(B13,lista!$A$3:$E$1100,5,0))","v":"KG"},0.125,0.125,"KG",{"$f":"IF(B13=\"\",\"\",VLOOKUP(B13,lista!$A$3:$K$1100,10,0))","v":5.95},0.74375000000000002]
[null,"AJO",{"$f":"IF(B14=\"\",\"\",VLOOKUP(B14,lista!$A$3:$L$1100,8,0))","v":0.95},5.0000000000000044E-2,5.2631578947368429E-3,5.0000000000000001E-3,{"$f":"IF(B14=\"\",\"\",VLOOKUP(B14,lista!$A$3:$E$1100,5,0))","v":"Kg"},0.13157894736842105,0.125,"Kg",{"$f":"IF(B14=\"\",\"\",VLOOKUP(B14,lista!$A$3:$K$1100,10,0))","v":3.9},0.51315789473684204]
[null,"SAL GRUESA ",{"$f":"IF(B15=\"\",\"\",VLOOKUP(B15,lista!$A$3:$L$1100,8,0))","v":1},0,2E-3,2E-3,{"$f":"IF(B15=\"\",\"\",VLOOKUP(B15,lista!$A$3:$E$1100,5,0))","v":"KG"},0.05,0.05,"KG",{"$f":"IF(B15=\"\",\"\",VLOOKUP(B15,lista!$A$3:$K$1100,10,0))","v":0.25},1.2500000000000001E-2]
[null,null,{"$f":"IF(B16=\"\",\"\",VLOOKUP(B16,lista!$A$3:$L$1100,8,0))","v":""},{"$f":"IF(C16=\"\",\"\",1-C16)","v":""},{"$f":"IF(B16=\"\",\"\",F16/C16)","v":""},null,{"$f":"IF(B16=\"\",\"\",VLOOKUP(B16,lista!$A$3:$E$1100,5,0))","v":""},{"$f":"IF(B16=\"\",\"\",I16/C16)","v":""},{"$f":"$J$8*F16/$G$8","v":0},{"$f":"G16","v":""},{"$f":"IF(B16=\"\",\"\",VLOOKUP(B16,lista!$A$3:$K$1100,10,0))","v":""},{"$f":"IF(B16=\"\",\"\",K16*H16)","v":""}]
[null,null,{"$f":"IF(B17=\"\",\"\",VLOOKUP(B17,lista!$A$3:$L$1100,8,0))","v":""},"","",null,{"$f":"IF(B17=\"\",\"\",VLOOKUP(B17,lista!$A$3:$E$1100,5,0))","v":""},"",0,"",{"$f":"IF(B17=\"\",\"\",VLOOKUP(B17,lista!$A$3:$K$1100,10,0))","v":""},""]
[null,null,{"$f":"IF(B18=\"\",\"\",VLOOKUP(B18,lista!$A$3:$L$1100,8,0))","v":""},"","",null,{"$f":"IF(B18=\"\",\"\",VLOOKUP(B18,lista!$A$3:$E$1100,5,0))","v":""},"",0,"",{"$f":"IF(B18=\"\",\"\",VLOOKUP(B18,lista!$A$3:$K$1100,10,0))","v":""},""]
[null,"PROCESO ELABORACION"]
[null,"ELABORACION",null,null,null,null,null,"Tempo","Ude","PRECAUCIONS"]
[null,"1. Limpar a pescada e cortar toros de 200 gr. Refrixerar.",null,null,null,null,null,6,"min"]
[null,"2. Pelar patacas e cortar tamén en toros regulares.",null,null,null,null,null,4]
[null,"3.Sobre comanda, pór as patacas a cocer co sal e o loureiro.",null,null,null,null,null,16]
[null,"4. Cando case estean as patacas amécese a pescada. Ao ferver retirar do lume e agardar 2'.",null,null,null,null,null,2]
[null,"5. Escorrer, empratar e salsear coa allada. ",null,null,null,null,null,1]
[null,"Mollo/gornición"]
[]
[null,"1. Atemperar o aceite cos allos enteiros pero lixeiramente esmagados. Manter 30' sen superar os 100ºC"]
[null,"2. Amecer o pementón e remexer.Deixar infusionar."]
[null,"3. Coar e decantar, reservando os dentes de allo."]
[]
[]
[null,null,null,null,"Utensilios",null,null,null,"Foto"]
[]
[]
[null,"CUSTE M.P receita",{"$f":"SUM(L10:L18)","v":73.027741228070184},null,"Ceboleiro","√"]
[null,"Custe ración",{"$f":"C36/J8","v":2.9211096491228075},null,"Puntilla","√"]
[null,"marxe erro",{"$f":"C37*D38","v":0.14605548245614039},0.05,"Pelador","√"]
[null,"custe ración inc mx",{"$f":"C37+C38","v":3.0671651315789479},null,"Táboa de corte","√"]
[null,"% Benef bruto",0.65,null,"Deshuesador"]
[null,"Benef bruto",{"$f":"C42-C39","v":5.6961638157894754},null,"Rondón","√"]
[null,"PVP",{"$f":"C39/(1-C40)","v":8.7633289473684233},null,"Espumadera","√"]
[null,"ive",{"$f":"C42*D43","v":0.87633289473684239},0.1,"Coador ","√"]
[null,"Pvp con ive",{"$f":"C42+C43","v":9.6396618421052658},null,"Cazo","√"]
[null,"Presentación"]

{"sheet":"Hoja2","index":3,"n_rows":0,"n_cols":0,"rows_kept":0,"cut":false,"hidden":false,"merged":[]}